program: Orca
programVersion: 5.0.2
elementType: O O O C C C C C C C C C C C C C C C C C C C C C C C H H H H H H H H H H H H H H H H H H H H H H H H H H
charge: 0
multiplicity: 1
keywords: wb97x-d3
keywords: def2-TZVPP
keywords: def2/J RIJCOSX
keywords: DEFGRID2
keywords: scfconv7
keywords: smallprint printgap noloewdin
keywords: NOSOSCF
formula: C23H26O3
InChI: InChI=1/C23H26O3/c1-16(2)13-20-21(23(20,3)4)22(24)25-15-17-9-8-12-19(14-17)26-18-10-6-5-7-11-18/h5-14,20-21H,15H2,1-4H3
52 atoms
O  0.450716 -2.695541 -1.132553
O  -0.11018 -2.575099 1.026038
O  2.295369 2.012778 -1.067847
C  -2.969294 -3.217754 -0.170255
C  -2.878317 -1.762437 0.178709
C  -1.794127 -2.397716 -0.67279
C  -3.948117 -3.68104 -1.222375
C  -2.775611 -4.229184 0.932923
C  -3.739238 -0.735723 -0.439815
C  -0.43043 -2.56002 -0.13813
C  -4.345861 0.285563 0.174081
C  -5.173216 1.26028 -0.609638
C  -4.279982 0.570104 1.643251
C  1.827836 -2.817026 -0.783574
C  2.419044 -1.528117 -0.284075
C  2.060653 -0.314189 -0.861822
C  3.362264 -1.54862 0.735741
C  2.649785 0.860873 -0.421903
C  3.954179 -0.366685 1.159189
C  3.606225 0.846326 0.586918
C  2.109865 3.165238 -0.354989
C  2.575354 4.343536 -0.921291
C  1.432711 3.180798 0.858962
C  2.356484 5.547804 -0.267605
C  1.231172 4.391036 1.50613
C  1.690373 5.577669 0.949716
H  -2.580486 -1.576664 1.20527
H  -1.829489 -2.164783 -1.731507
H  -4.0334 -2.992081 -2.061739
H  -4.943853 -3.803603 -0.791018
H  -3.64255 -4.648667 -1.625356
H  -2.319694 -5.144883 0.550044
H  -3.745659 -4.499226 1.355398
H  -2.158128 -3.862245 1.749893
H  -3.875346 -0.8205 -1.514143
H  -6.214104 1.254071 -0.274491
H  -5.163655 1.044785 -1.6782
H  -4.811305 2.282678 -0.470376
H  -3.706674 -0.160679 2.210242
H  -5.285572 0.603869 2.070783
H  -3.837568 1.553286 1.824631
H  2.317203 -3.120181 -1.710082
H  1.976681 -3.619234 -0.057582
H  1.325342 -0.269504 -1.656684
H  3.634853 -2.487652 1.201599
H  4.693931 -0.387715 1.949058
H  4.077087 1.761998 0.921935
H  3.100155 4.316187 -1.868168
H  1.058225 2.263917 1.297134
H  2.718527 6.465878 -0.712304
H  0.703495 4.403252 2.45117
H  1.526334 6.518213 1.458897
elementType: O C H
totalener: -1117.87077891 hartree
nucrepener: 2215.58810036 hartree
electener: -3333.45887927 hartree
oneelecener: -5921.08127936 hartree
twoeener: 2587.62240009 hartree
cpcmener: -0.02601298 hartree
kineticenergy: 1112.80307578 hartree
xcener: -110.226975004363 hartree
chargesum: -0.0000000
charge: -0.292138 -0.465615 -0.331082 0.095834 0.044411 -0.084992 -0.267828 -0.274762 -0.275672 0.386938 -0.051727 -0.217553 -0.250884 0.103735 0.033587 -0.264083 -0.213440 0.245361 -0.134611 -0.184410 0.260961 -0.236612 -0.172437 -0.128949 -0.154346 -0.179497 0.091516 0.086312 0.087382 0.097464 0.096935 0.098130 0.095404 0.092329 0.114797 0.093025 0.087310 0.092275 0.089614 0.094308 0.096478 0.120651 0.114082 0.128896 0.141381 0.158418 0.156464 0.145430 0.157280 0.156813 0.158993 0.158125
qa: -0.2921 -0.4656 -0.3311 0.0958 0.0444 -0.0850 -0.2678 -0.2748 -0.2757 0.3869 -0.0517 -0.2176 -0.2509 0.1037 0.0336 -0.2641 -0.2134 0.2454 -0.1346 -0.1844 0.2610 -0.2366 -0.1724 -0.1289 -0.1543 -0.1795 0.0915 0.0863 0.0874 0.0975 0.0969 0.0981 0.0954 0.0923 0.1148 0.0930 0.0873 0.0923 0.0896 0.0943 0.0965 0.1207 0.1141 0.1289 0.1414 0.1584 0.1565 0.1454 0.1573 0.1568 0.1590 0.1581
va: 2.1147 2.0419 2.0639 3.7105 3.7691 3.8085 3.9094 3.9037 3.8798 4.1753 3.7690 3.9205 3.9409 3.7937 3.6409 4.0505 3.9655 3.7651 3.9034 3.9141 3.7108 3.9997 3.8932 3.8927 3.8965 3.8962 1.0318 1.0376 1.0066 1.0016 1.0018 0.9996 1.0002 1.0198 1.0122 0.9962 1.0093 0.9965 1.0104 0.9972 0.9967 0.9915 1.0101 1.0299 1.0033 0.9906 0.9959 1.0080 0.9974 0.9895 0.9906 0.9903
dispcorr: -0.022907979 hartree
energy: -1117.893686892996
dipole: -28.93348 28.62601 -0.30747 -6.64592 6.67334 0.02742 3.52518 -3.76164 -0.23646
magnitude: 0.38885 au
magnitude: 0.98839 debye
