program: Orca
programVersion: 5.0.2
elementType: O O O C C C C C C C C C C C C C C C C C C C C C C C H H H H H H H H H H H H H H H H H H H H H H H H H H
charge: 0
multiplicity: 1
keywords: wb97x-d3
keywords: def2-TZVPP
keywords: def2/J RIJCOSX
keywords: DEFGRID2
keywords: scfconv7
keywords: smallprint printgap noloewdin
keywords: NOSOSCF
formula: C23H26O3
InChI: InChI=1/C23H26O3/c1-16(2)13-20-21(23(20,3)4)22(24)25-15-17-9-8-12-19(14-17)26-18-10-6-5-7-11-18/h5-14,20-21H,15H2,1-4H3
52 atoms
O  0.123941 -2.352081 -0.246658
O  -0.981869 -0.9825 1.128038
O  2.330727 3.121004 0.226288
C  -3.265086 -3.113834 0.785432
C  -3.535199 -1.959965 -0.130773
C  -2.169248 -2.628411 -0.146343
C  -3.834546 -4.476222 0.469288
C  -3.188115 -2.844103 2.268286
C  -4.388994 -2.071569 -1.329243
C  -0.987679 -1.889426 0.33024
C  -5.283777 -1.178465 -1.765512
C  -6.068298 -1.435369 -3.017442
C  -5.596464 0.12452 -1.095702
C  1.348915 -1.680523 0.04941
C  1.423291 -0.328157 -0.60303
C  1.839819 0.772594 0.131564
C  1.095837 -0.173449 -1.948866
C  1.950258 2.013629 -0.484366
C  1.183836 1.074382 -2.543745
C  1.619547 2.176229 -1.818871
C  3.500721 3.092189 0.932438
C  4.604327 2.351182 0.524751
C  3.564639 3.883243 2.072536
C  5.769836 2.400879 1.276759
C  4.739536 3.928932 2.808078
C  5.845501 3.184302 2.419873
H  -3.543982 -0.997339 0.369092
H  -1.974546 -3.281021 -0.990218
H  -3.267871 -5.252845 0.986962
H  -3.812562 -4.713345 -0.593673
H  -4.871763 -4.54647 0.803813
H  -4.168967 -3.008957 2.719022
H  -2.889755 -1.825813 2.505835
H  -2.486264 -3.524281 2.755793
H  -4.25999 -2.975559 -1.91751
H  -7.141666 -1.462437 -2.810203
H  -5.794818 -2.378556 -3.490653
H  -5.916768 -0.636219 -3.748337
H  -5.357157 0.96373 -1.754138
H  -5.065478 0.280142 -0.159204
H  -6.665943 0.198844 -0.883378
H  2.122513 -2.337605 -0.349022
H  1.503516 -1.605832 1.127519
H  2.07549 0.662745 1.184086
H  0.770237 -1.024031 -2.53471
H  0.924775 1.193535 -3.587804
H  1.699148 3.15043 -2.28456
H  4.567907 1.742668 -0.369948
H  2.699407 4.458245 2.37854
H  6.62693 1.821972 0.957128
H  4.784594 4.54567 3.69654
H  6.757807 3.21643 3.000633
elementType: O C H
totalener: -1117.87051558 hartree
nucrepener: 2175.17666707 hartree
electener: -3293.04718265 hartree
oneelecener: -5840.25402198 hartree
twoeener: 2547.20683933 hartree
cpcmener: -0.02636945 hartree
kineticenergy: 1112.80673369 hartree
xcener: -110.227112353939 hartree
chargesum: -0.0000000
charge: -0.290952 -0.469002 -0.332260 0.099687 0.043737 -0.090657 -0.270368 -0.276354 -0.274774 0.392638 -0.051581 -0.218020 -0.251786 0.101615 0.027331 -0.174028 -0.237714 0.225572 -0.125310 -0.224746 0.270082 -0.174818 -0.241046 -0.158526 -0.125255 -0.186485 0.093056 0.085961 0.096803 0.087716 0.097198 0.094869 0.092826 0.097639 0.115329 0.093073 0.088158 0.092197 0.097204 0.089624 0.094127 0.123210 0.112785 0.143549 0.142188 0.157293 0.146982 0.152317 0.146092 0.158964 0.156836 0.157025
qa: -0.2910 -0.4690 -0.3323 0.0997 0.0437 -0.0907 -0.2704 -0.2764 -0.2748 0.3926 -0.0516 -0.2180 -0.2518 0.1016 0.0273 -0.1740 -0.2377 0.2256 -0.1253 -0.2247 0.2701 -0.1748 -0.2410 -0.1585 -0.1253 -0.1865 0.0931 0.0860 0.0968 0.0877 0.0972 0.0949 0.0928 0.0976 0.1153 0.0931 0.0882 0.0922 0.0972 0.0896 0.0941 0.1232 0.1128 0.1435 0.1422 0.1573 0.1470 0.1523 0.1461 0.1590 0.1568 0.1570
va: 2.1165 2.0411 2.0666 3.6996 3.7713 3.8154 3.9118 3.9025 3.8810 4.1755 3.7672 3.9202 3.9413 3.7981 3.6156 3.9467 3.9562 3.7547 3.8949 4.0137 3.7114 3.8735 3.9930 3.9060 3.8949 3.9013 1.0313 1.0372 1.0017 1.0065 1.0018 0.9999 1.0205 0.9995 1.0121 0.9964 1.0089 0.9962 0.9964 1.0112 0.9973 0.9910 1.0109 1.0072 1.0106 0.9894 1.0046 1.0000 1.0082 0.9906 0.9892 0.9907
dispcorr: -0.022769128 hartree
energy: -1117.893284703973
dipole: -30.12967 30.21860 0.08893 -15.83448 14.73102 -1.10346 -3.13015 2.46483 -0.66531
magnitude: 1.29157 au
magnitude: 3.28292 debye
