program: Orca
programVersion: 5.0.2
elementType: O O O C C C C C C C C C C C C C C C C C C C C C C C H H H H H H H H H H H H H H H H H H H H H H H H H H
charge: 0
multiplicity: 1
keywords: wb97x-d3
keywords: def2-TZVPP
keywords: def2/J RIJCOSX
keywords: DEFGRID2
keywords: scfconv7
keywords: smallprint printgap noloewdin
keywords: NOSOSCF
formula: C23H26O3
InChI: InChI=1/C23H26O3/c1-16(2)13-20-21(23(20,3)4)22(24)25-15-17-9-8-12-19(14-17)26-18-10-6-5-7-11-18/h5-14,20-21H,15H2,1-4H3
52 atoms
O  -0.023851 -1.678057 -1.416418
O  0.149641 -3.742036 -0.574443
O  3.471456 1.927283 0.660683
C  -2.08421 -1.530944 0.957695
C  -2.6989 -1.321878 -0.398065
C  -1.829179 -2.527515 -0.161948
C  -2.954815 -2.012878 2.090659
C  -0.989094 -0.592165 1.402923
C  -4.150066 -1.515413 -0.645491
C  -0.478337 -2.720301 -0.72915
C  -5.056445 -0.534619 -0.67465
C  -6.499267 -0.814146 -0.965375
C  -4.725538 0.905403 -0.428144
C  1.336424 -1.695174 -1.878874
C  2.263782 -1.222597 -0.796189
C  2.420928 0.14529 -0.591766
C  2.93431 -2.125033 0.023012
C  3.228406 0.602117 0.441003
C  3.747044 -1.656639 1.045374
C  3.890062 -0.296593 1.267657
C  2.50691 2.872899 0.44909
C  1.176553 2.676355 0.799793
C  2.92701 4.087496 -0.075441
C  0.265258 3.703807 0.602053
C  2.007612 5.111292 -0.251894
C  0.672447 4.923022 0.077283
H  -2.239219 -0.523023 -0.971391
H  -2.345869 -3.473959 -0.036476
H  -2.349082 -2.477337 2.87149
H  -3.696001 -2.744038 1.769249
H  -3.491695 -1.176455 2.543668
H  -0.471187 -0.118833 0.571335
H  -0.244419 -1.106947 2.014059
H  -1.416365 0.206432 2.013228
H  -4.487159 -2.533124 -0.822591
H  -6.684991 -1.871535 -1.15437
H  -6.840042 -0.252041 -1.839187
H  -7.135928 -0.503403 -0.132634
H  -4.912766 1.508025 -1.321036
H  -3.691229 1.066515 -0.128158
H  -5.36472 1.31623 0.357461
H  1.348034 -1.010653 -2.725693
H  1.611114 -2.685711 -2.241833
H  1.914837 0.844626 -1.247443
H  2.828234 -3.189572 -0.137461
H  4.269954 -2.357219 1.683434
H  4.519976 0.070013 2.06855
H  0.847891 1.738572 1.229606
H  3.968223 4.229718 -0.337046
H  -0.77155 3.547248 0.871093
H  2.339841 6.057806 -0.658566
H  -0.043854 5.720519 -0.069406
elementType: O C H
totalener: -1117.86669427 hartree
nucrepener: 2274.46058519 hartree
electener: -3392.32727946 hartree
oneelecener: -6037.86535151 hartree
twoeener: 2645.53807205 hartree
cpcmener: -0.02495492 hartree
kineticenergy: 1112.81114372 hartree
xcener: -110.227388592627 hartree
chargesum: -0.0000000
charge: -0.269828 -0.467080 -0.327835 0.153883 0.025064 -0.135599 -0.272321 -0.310070 -0.284337 0.402297 -0.032948 -0.229038 -0.250311 0.050624 -0.000401 -0.253131 -0.181878 0.314784 -0.126804 -0.247585 0.275587 -0.200614 -0.235118 -0.171010 -0.129021 -0.172625 0.103963 0.093936 0.100324 0.090671 0.094792 0.074739 0.110234 0.101837 0.119579 0.088989 0.093674 0.094041 0.100959 0.085328 0.094996 0.118923 0.117523 0.143486 0.142313 0.157270 0.146002 0.187717 0.144778 0.155138 0.156802 0.157300
qa: -0.2698 -0.4671 -0.3278 0.1539 0.0251 -0.1356 -0.2723 -0.3101 -0.2843 0.4023 -0.0329 -0.2290 -0.2503 0.0506 -0.0004 -0.2531 -0.1819 0.3148 -0.1268 -0.2476 0.2756 -0.2006 -0.2351 -0.1710 -0.1290 -0.1726 0.1040 0.0939 0.1003 0.0907 0.0948 0.0747 0.1102 0.1018 0.1196 0.0890 0.0937 0.0940 0.1010 0.0853 0.0950 0.1189 0.1175 0.1435 0.1423 0.1573 0.1460 0.1877 0.1448 0.1551 0.1568 0.1573
va: 2.1195 2.0346 2.0880 3.6740 3.7457 3.8931 3.9037 3.9019 3.8548 4.2147 3.7082 3.9294 3.9432 3.8309 3.6177 3.9363 3.9307 3.6787 3.9271 4.0121 3.7365 3.8939 3.9933 3.9198 3.8904 3.9015 1.0164 1.0335 1.0021 1.0032 1.0021 1.0076 0.9978 1.0012 1.0085 1.0077 0.9952 0.9964 0.9981 1.0079 0.9983 1.0001 1.0108 1.0073 1.0181 0.9896 1.0070 0.9710 1.0086 0.9948 0.9895 0.9906
dispcorr: -0.026586951 hartree
energy: -1117.893281218371
dipole: -30.44958 29.51944 -0.93014 0.35271 0.96621 1.31892 3.77711 -3.87278 -0.09567
magnitude: 1.61674 au
magnitude: 4.10943 debye
