program: Orca
programVersion: 5.0.2
elementType: O O O C C C C C C C C C C C C C C C C C C C C C C C H H H H H H H H H H H H H H H H H H H H H H H H H H
charge: 0
multiplicity: 1
keywords: wb97x-d3
keywords: def2-TZVPP
keywords: def2/J RIJCOSX
keywords: DEFGRID2
keywords: scfconv7
keywords: smallprint printgap noloewdin
keywords: NOSOSCF
formula: C23H26O3
InChI: InChI=1/C23H26O3/c1-16(2)13-20-21(23(20,3)4)22(24)25-15-17-9-8-12-19(14-17)26-18-10-6-5-7-11-18/h5-14,20-21H,15H2,1-4H3
52 atoms
O  0.468044 -2.468604 -1.093402
O  0.209596 -2.203901 1.109203
O  2.658297 2.068238 -0.466981
C  -2.842531 -2.395818 0.444411
C  -2.461899 -0.953494 0.499396
C  -1.654934 -1.898498 -0.366585
C  -4.040978 -2.800158 -0.380717
C  -2.645715 -3.259256 1.66551
C  -3.322024 0.101024 -0.096149
C  -0.25977 -2.200535 -0.003732
C  -2.985924 0.994936 -1.03007
C  -3.980792 2.001014 -1.52635
C  -1.634159 1.092675 -1.666967
C  1.849502 -2.762586 -0.912804
C  2.659929 -1.587641 -0.43685
C  2.273099 -0.28157 -0.704279
C  3.840223 -1.820218 0.262618
C  3.039431 0.772883 -0.228648
C  4.62067 -0.758405 0.691575
C  4.217417 0.550086 0.463628
C  1.484303 2.531753 0.053233
C  1.019524 3.735608 -0.466176
C  0.783255 1.887102 1.066793
C  -0.149704 4.291066 0.028742
C  -0.390657 2.454753 1.545713
C  -0.865235 3.653548 1.034469
H  -1.960951 -0.666432 1.422423
H  -1.832905 -1.837033 -1.434155
H  -4.958901 -2.72132 0.205841
H  -3.948631 -3.83794 -0.707623
H  -4.162086 -2.18246 -1.270655
H  -1.853621 -2.905288 2.320661
H  -2.419057 -4.291339 1.388422
H  -3.568231 -3.275018 2.250924
H  -4.332715 0.14318 0.303342
H  -3.646794 3.018937 -1.306672
H  -4.966558 1.865774 -1.081108
H  -4.090084 1.940878 -2.612582
H  -1.679104 0.796947 -2.718956
H  -0.8801 0.481379 -1.178881
H  -1.283252 2.127221 -1.655215
H  2.191494 -3.08331 -1.897593
H  1.976372 -3.608242 -0.232926
H  1.368993 -0.070162 -1.262819
H  4.147581 -2.836599 0.477666
H  5.538683 -0.947836 1.231942
H  4.805856 1.385043 0.822152
H  1.576079 4.231886 -1.251727
H  1.130866 0.952715 1.488139
H  -0.503742 5.229111 -0.379567
H  -0.933154 1.948209 2.333859
H  -1.780264 4.087386 1.415497
elementType: O C H
totalener: -1117.86811607 hartree
nucrepener: 2378.66199870 hartree
electener: -3496.53011477 hartree
oneelecener: -6247.12098025 hartree
twoeener: 2750.59086548 hartree
cpcmener: -0.02437113 hartree
kineticenergy: 1112.80588283 hartree
xcener: -110.232306708335 hartree
chargesum: -0.0000000
charge: -0.294874 -0.462101 -0.329221 0.126896 -0.014007 -0.055752 -0.279829 -0.284100 -0.291636 0.349065 -0.008590 -0.226842 -0.222632 0.076207 0.035969 -0.241600 -0.202745 0.235669 -0.128738 -0.216229 0.319517 -0.255426 -0.190089 -0.110114 -0.165258 -0.202174 0.096740 0.103510 0.097243 0.099368 0.090639 0.093591 0.098090 0.093376 0.117398 0.093369 0.089305 0.095685 0.118745 0.032781 0.099718 0.124692 0.115908 0.180727 0.140324 0.157664 0.146574 0.141467 0.144651 0.154006 0.157974 0.155085
qa: -0.2949 -0.4621 -0.3292 0.1269 -0.0140 -0.0558 -0.2798 -0.2841 -0.2916 0.3491 -0.0086 -0.2268 -0.2226 0.0762 0.0360 -0.2416 -0.2027 0.2357 -0.1287 -0.2162 0.3195 -0.2554 -0.1901 -0.1101 -0.1653 -0.2022 0.0967 0.1035 0.0972 0.0994 0.0906 0.0936 0.0981 0.0934 0.1174 0.0934 0.0893 0.0957 0.1187 0.0328 0.0997 0.1247 0.1159 0.1807 0.1403 0.1577 0.1466 0.1415 0.1447 0.1540 0.1580 0.1551
va: 2.1134 2.0336 2.0797 3.7606 3.7819 3.7830 3.9017 3.8902 3.8498 4.1589 3.7335 3.9265 3.9116 3.8082 3.5925 3.9568 3.9587 3.7479 3.8872 4.0139 3.6566 3.9769 3.7997 3.8615 3.8552 3.8662 1.0220 1.0268 1.0018 1.0025 1.0046 1.0210 0.9988 1.0008 1.0068 0.9965 1.0070 0.9976 1.0038 1.0197 1.0002 0.9902 1.0087 0.9869 1.0016 0.9891 1.0038 1.0111 1.0128 0.9898 0.9912 0.9920
dispcorr: -0.030505634 hartree
energy: -1117.898621699209
dipole: -25.08123 24.50101 -0.58022 -3.45613 3.00844 -0.44769 -2.34011 1.60886 -0.73125
magnitude: 1.03529 au
magnitude: 2.63149 debye
