program: Orca
programVersion: 5.0.2
elementType: O O O C C C C C C C C C C C C C C C C C C C C C C C H H H H H H H H H H H H H H H H H H H H H H H H H H
charge: 0
multiplicity: 1
keywords: wb97x-d3
keywords: def2-TZVPP
keywords: def2/J RIJCOSX
keywords: DEFGRID2
keywords: scfconv7
keywords: smallprint printgap noloewdin
keywords: NOSOSCF
formula: C23H26O3
InChI: InChI=1/C23H26O3/c1-16(2)13-20-21(23(20,3)4)22(24)25-15-17-9-8-12-19(14-17)26-18-10-6-5-7-11-18/h5-14,20-21H,15H2,1-4H3
52 atoms
O  0.350017 -2.356049 0.108609
O  -0.507918 -1.223398 -1.624725
O  3.383479 1.717078 0.803103
C  -2.235621 -0.023115 0.749536
C  -3.070546 -0.938001 -0.097354
C  -1.732836 -1.419575 0.424774
C  -2.610765 0.217919 2.191271
C  -1.611729 1.184196 0.093385
C  -4.303279 -1.586062 0.390546
C  -0.600599 -1.634837 -0.493223
C  -5.45209 -1.653401 -0.288542
C  -6.647377 -2.354821 0.279359
C  -5.630491 -1.04662 -1.655981
C  1.552178 -2.660279 -0.589982
C  2.67909 -1.740416 -0.204992
C  2.457659 -0.409779 0.132322
C  3.978151 -2.238526 -0.220862
C  3.537338 0.414319 0.425035
C  5.045809 -1.408979 0.086356
C  4.835423 -0.0769 0.404629
C  2.37188 2.48934 0.301295
C  1.755683 3.363562 1.186053
C  2.01214 2.470335 -1.041386
C  0.779027 4.232406 0.720876
C  1.02385 3.335314 -1.48908
C  0.40493 4.219729 -0.615506
H  -3.070622 -0.679605 -1.151638
H  -1.7658 -2.112227 1.258882
H  -2.978613 -0.677489 2.690879
H  -3.38798 0.981881 2.263358
H  -1.745321 0.572906 2.754471
H  -1.41585 1.04432 -0.967212
H  -0.6717 1.452908 0.581055
H  -2.2839 2.039294 0.187765
H  -4.255406 -2.051134 1.370749
H  -6.448822 -2.780335 1.263335
H  -6.975693 -3.165233 -0.377545
H  -7.497157 -1.672772 0.372107
H  -4.980098 -1.513569 -2.399045
H  -5.408334 0.021992 -1.664583
H  -6.654802 -1.164741 -2.00946
H  1.392876 -2.633684 -1.670106
H  1.803004 -3.687066 -0.322756
H  1.454875 -0.004112 0.174598
H  4.154846 -3.278496 -0.46746
H  6.053932 -1.802597 0.07999
H  5.665822 0.574671 0.645392
H  2.048462 3.369095 2.228612
H  2.496977 1.797154 -1.737268
H  0.30613 4.918115 1.412101
H  0.743107 3.319929 -2.534407
H  -0.360563 4.894619 -0.975069
elementType: O C H
totalener: -1117.86901156 hartree
nucrepener: 2281.08047541 hartree
electener: -3398.94948697 hartree
oneelecener: -6051.75906767 hartree
twoeener: 2652.80958070 hartree
cpcmener: -0.02471783 hartree
kineticenergy: 1112.79217274 hartree
xcener: -110.227836992888 hartree
chargesum: 0.0000000
charge: -0.283324 -0.459815 -0.326421 0.144353 0.042658 -0.101008 -0.278828 -0.297290 -0.301410 0.366675 -0.012430 -0.222605 -0.285537 0.081781 0.024585 -0.208123 -0.227232 0.283183 -0.107236 -0.259674 0.281811 -0.227060 -0.195670 -0.129624 -0.148590 -0.180683 0.092987 0.086895 0.089796 0.098031 0.098889 0.100967 0.067228 0.108000 0.114931 0.084391 0.097177 0.096111 0.102832 0.104435 0.094992 0.111168 0.117202 0.152016 0.139033 0.156274 0.144356 0.143524 0.155703 0.156372 0.158110 0.156093
qa: -0.2833 -0.4598 -0.3264 0.1444 0.0427 -0.1010 -0.2788 -0.2973 -0.3014 0.3667 -0.0124 -0.2226 -0.2855 0.0818 0.0246 -0.2081 -0.2272 0.2832 -0.1072 -0.2597 0.2818 -0.2271 -0.1957 -0.1296 -0.1486 -0.1807 0.0930 0.0869 0.0898 0.0980 0.0989 0.1010 0.0672 0.1080 0.1149 0.0844 0.0972 0.0961 0.1028 0.1044 0.0950 0.1112 0.1172 0.1520 0.1390 0.1563 0.1444 0.1435 0.1557 0.1564 0.1581 0.1561
va: 2.1175 2.0405 2.0863 3.6860 3.7837 3.8540 3.9094 3.9008 3.9010 4.2334 3.6969 3.9208 3.9402 3.8412 3.6876 3.9418 3.9603 3.7549 3.8964 4.0047 3.6858 3.9701 3.8945 3.8685 3.8448 3.8607 1.0283 1.0378 1.0061 1.0015 1.0008 1.0147 1.0071 1.0020 1.0109 1.0104 0.9926 0.9930 0.9967 0.9955 1.0047 1.0140 0.9960 0.9714 1.0037 0.9894 1.0085 1.0090 0.9966 0.9900 0.9914 0.9918
dispcorr: -0.026393088 hartree
energy: -1117.895404646165
dipole: -31.64400 31.12363 -0.52037 -2.18193 1.82735 -0.35458 1.08198 -0.65517 0.42681
magnitude: 0.76071 au
magnitude: 1.93356 debye
