program: Orca
programVersion: 5.0.2
elementType: O O O C C C C C C C C C C C C C C C C C C C C C C C H H H H H H H H H H H H H H H H H H H H H H H H H H
charge: 0
multiplicity: 1
keywords: wb97x-d3
keywords: def2-TZVPP
keywords: def2/J RIJCOSX
keywords: DEFGRID2
keywords: scfconv7
keywords: smallprint printgap noloewdin
keywords: NOSOSCF
formula: C23H26O3
InChI: InChI=1/C23H26O3/c1-16(2)13-20-21(23(20,3)4)22(24)25-15-17-9-8-12-19(14-17)26-18-10-6-5-7-11-18/h5-14,20-21H,15H2,1-4H3
52 atoms
O  0.329593 -2.266311 -0.208043
O  -0.617415 -3.482411 -1.822947
O  2.661314 2.161585 -0.130965
C  -2.587303 -2.171228 0.90408
C  -2.106923 -0.861163 0.377053
C  -1.999752 -2.095431 -0.497654
C  -4.071828 -2.440105 0.958852
C  -1.824316 -2.836767 2.02297
C  -3.030394 0.242548 0.003817
C  -0.71355 -2.691965 -0.912273
C  -2.81683 1.10718 -0.991666
C  -3.770414 2.224951 -1.281647
C  -1.615052 1.05299 -1.881216
C  1.648719 -2.623247 -0.615206
C  2.571456 -1.502399 -0.230843
C  2.157329 -0.180741 -0.35433
C  3.863112 -1.779504 0.20238
C  3.022473 0.848082 -0.010931
C  4.731055 -0.740479 0.506299
C  4.314462 0.57888 0.416618
C  1.423107 2.582001 0.267967
C  0.880832 3.661587 -0.416315
C  0.741893 2.011043 1.337876
C  -0.352254 4.168172 -0.03013
C  -0.495888 2.52043 1.703199
C  -1.050445 3.597503 1.025114
H  -1.159986 -0.531354 0.798611
H  -2.738356 -2.180104 -1.287481
H  -4.268643 -3.513696 0.933112
H  -4.610517 -1.98802 0.125692
H  -4.501739 -2.050068 1.884077
H  -2.254929 -2.547198 2.98399
H  -0.771144 -2.563576 2.047908
H  -1.889293 -3.924497 1.951321
H  -3.918538 0.368468 0.617219
H  -3.261662 3.192442 -1.248749
H  -4.600486 2.256362 -0.575679
H  -4.187475 2.132824 -2.288261
H  -1.001642 1.947579 -1.746456
H  -1.910413 1.039582 -2.933696
H  -0.98344 0.185808 -1.700233
H  1.683772 -2.785642 -1.695042
H  1.944472 -3.556555 -0.130977
H  1.162127 0.050793 -0.713396
H  4.192506 -2.806301 0.303683
H  5.737254 -0.959088 0.839254
H  4.981954 1.390777 0.675962
H  1.4211 4.100128 -1.246158
H  1.162352 1.180552 1.890198
H  -0.771027 5.009189 -0.5679
H  -1.026528 2.068994 2.531775
H  -2.015942 3.988573 1.317811
elementType: O C H
totalener: -1117.86532762 hartree
nucrepener: 2373.23235260 hartree
electener: -3491.09768022 hartree
oneelecener: -6235.29332528 hartree
twoeener: 2744.19564506 hartree
cpcmener: -0.02506729 hartree
kineticenergy: 1112.80719618 hartree
xcener: -110.232395573391 hartree
chargesum: -0.0000000
charge: -0.281589 -0.470678 -0.327990 0.146977 0.034325 -0.124082 -0.293405 -0.278394 -0.315204 0.413438 -0.007196 -0.226408 -0.255286 0.053110 0.011589 -0.182178 -0.216193 0.270395 -0.110822 -0.252264 0.318694 -0.245341 -0.211661 -0.126604 -0.150397 -0.189267 0.089768 0.092998 0.098261 0.092764 0.097258 0.094289 0.089656 0.100647 0.119270 0.086406 0.091250 0.103865 0.095398 0.113279 0.077740 0.116329 0.116535 0.128043 0.140637 0.156672 0.145445 0.142628 0.155434 0.155781 0.158282 0.157795
qa: -0.2816 -0.4707 -0.3280 0.1470 0.0343 -0.1241 -0.2934 -0.2784 -0.3152 0.4134 -0.0072 -0.2264 -0.2553 0.0531 0.0116 -0.1822 -0.2162 0.2704 -0.1108 -0.2523 0.3187 -0.2453 -0.2117 -0.1266 -0.1504 -0.1893 0.0898 0.0930 0.0983 0.0928 0.0973 0.0943 0.0897 0.1006 0.1193 0.0864 0.0912 0.1039 0.0954 0.1133 0.0777 0.1163 0.1165 0.1280 0.1406 0.1567 0.1454 0.1426 0.1554 0.1558 0.1583 0.1578
va: 2.1033 2.0372 2.0871 3.7507 3.7223 3.8599 3.9136 3.8867 3.8149 4.1219 3.6913 3.9230 3.9320 3.8214 3.7325 3.9082 3.9551 3.7370 3.8884 4.0115 3.6524 3.9526 3.8585 3.8445 3.8358 3.8414 1.0146 1.0283 1.0027 1.0019 0.9998 1.0012 1.0146 0.9997 1.0077 0.9978 1.0062 0.9979 1.0054 1.0050 1.0119 1.0108 0.9979 1.0087 1.0035 0.9891 1.0071 1.0102 0.9974 0.9908 0.9918 0.9901
dispcorr: -0.030682901 hartree
energy: -1117.896010521689
dipole: -22.17805 21.98577 -0.19227 -0.39318 0.97571 0.58253 2.68383 -1.67168 1.01215
magnitude: 1.18353 au
magnitude: 3.00830 debye
