program: Orca
programVersion: 5.0.2
elementType: O O O C C C C C C C C C C C C C C C C C C C C C C C H H H H H H H H H H H H H H H H H H H H H H H H H H
charge: 0
multiplicity: 1
keywords: wb97x-d3
keywords: def2-TZVPP
keywords: def2/J RIJCOSX
keywords: DEFGRID2
keywords: scfconv7
keywords: smallprint printgap noloewdin
keywords: NOSOSCF
formula: C23H26O3
InChI: InChI=1/C23H26O3/c1-16(2)13-20-21(23(20,3)4)22(24)25-15-17-9-8-12-19(14-17)26-18-10-6-5-7-11-18/h5-14,20-21H,15H2,1-4H3
52 atoms
O  0.424582 -2.422367 0.068198
O  -0.422168 -1.290407 -1.670597
O  3.344848 1.724646 0.83738
C  -2.197947 -0.160724 0.708104
C  -3.006385 -1.037033 -0.20212
C  -1.694861 -1.548974 0.340812
C  -2.640955 0.020137 2.138796
C  -1.543378 1.068199 0.128912
C  -4.26576 -1.684892 0.23112
C  -0.532031 -1.723675 -0.548955
C  -5.484708 -1.40208 -0.237326
C  -6.69211 -2.144838 0.249134
C  -5.759591 -0.356939 -1.275734
C  1.647886 -2.689984 -0.609776
C  2.744252 -1.742764 -0.203502
C  2.484376 -0.420998 0.140421
C  4.056241 -2.206549 -0.207486
C  3.538731 0.428329 0.454281
C  5.097691 -1.352423 0.12088
C  4.848951 -0.028888 0.447784
C  2.317126 2.465738 0.320637
C  1.631315 3.290929 1.200518
C  2.004368 2.459528 -1.033883
C  0.629871 4.122722 0.71947
C  0.991478 3.286145 -1.498037
C  0.30118 4.120768 -0.628724
H  -2.970029 -0.73748 -1.244899
H  -1.755709 -2.274046 1.145867
H  -3.056903 -0.889341 2.57128
H  -3.40571 0.797183 2.204918
H  -1.801357 0.329241 2.764632
H  -0.616544 1.307065 0.655735
H  -2.211469 1.924715 0.241777
H  -1.315958 0.975052 -0.931018
H  -4.177916 -2.45674 0.990795
H  -6.435966 -2.921028 0.970507
H  -7.22233 -2.61974 -0.581055
H  -7.407694 -1.467273 0.722914
H  -4.904324 0.283697 -1.483847
H  -6.584411 0.287707 -0.96184
H  -6.07089 -0.815463 -2.218725
H  1.50664 -2.664292 -1.692482
H  1.921239 -3.710676 -0.341523
H  1.471354 -0.040488 0.171594
H  4.263646 -3.239096 -0.461438
H  6.115843 -1.71951 0.122176
H  5.659789 0.641262 0.703846
H  1.886132 3.287012 2.253042
H  2.543364 1.825002 -1.726428
H  0.099871 4.767658 1.408568
H  0.74715 3.279549 -2.552534
H  -0.485292 4.764276 -1.00056
elementType: O C H
totalener: -1117.86967137 hartree
nucrepener: 2286.13330605 hartree
electener: -3404.00297741 hartree
oneelecener: -6061.86760894 hartree
twoeener: 2657.86463153 hartree
cpcmener: -0.02478543 hartree
kineticenergy: 1112.79613113 hartree
xcener: -110.228724304585 hartree
chargesum: 0.0000000
charge: -0.282730 -0.457630 -0.327368 0.191967 0.011918 -0.133393 -0.269526 -0.326118 -0.286049 0.371896 -0.023456 -0.225977 -0.258163 0.080829 0.016681 -0.194974 -0.222147 0.271196 -0.111153 -0.253898 0.268802 -0.219165 -0.183675 -0.140310 -0.154521 -0.167500 0.096843 0.088721 0.089951 0.096447 0.099042 0.076804 0.108431 0.102424 0.118299 0.087911 0.093114 0.093887 0.090122 0.093160 0.100437 0.111412 0.117177 0.152650 0.138901 0.156119 0.144441 0.143477 0.154927 0.155361 0.157998 0.156407
qa: -0.2827 -0.4576 -0.3274 0.1920 0.0119 -0.1334 -0.2695 -0.3261 -0.2860 0.3719 -0.0235 -0.2260 -0.2582 0.0808 0.0167 -0.1950 -0.2221 0.2712 -0.1112 -0.2539 0.2688 -0.2192 -0.1837 -0.1403 -0.1545 -0.1675 0.0968 0.0887 0.0900 0.0964 0.0990 0.0768 0.1084 0.1024 0.1183 0.0879 0.0931 0.0939 0.0901 0.0932 0.1004 0.1114 0.1172 0.1526 0.1389 0.1561 0.1444 0.1435 0.1549 0.1554 0.1580 0.1564
va: 2.1193 2.0441 2.0846 3.6636 3.7812 3.8992 3.9017 3.9001 3.8900 4.2294 3.7086 3.9280 3.9452 3.8411 3.6951 3.9353 3.9548 3.7625 3.8997 4.0005 3.6998 3.9573 3.8910 3.8691 3.8485 3.8447 1.0272 1.0392 1.0040 1.0031 1.0018 1.0032 1.0020 1.0121 1.0089 1.0085 0.9948 0.9965 1.0066 0.9982 0.9964 1.0137 0.9959 0.9663 1.0036 0.9894 1.0083 1.0086 0.9966 0.9908 0.9914 0.9915
dispcorr: -0.026838609 hartree
energy: -1117.896509974399
dipole: -32.09640 31.52281 -0.57359 -1.06677 0.75738 -0.30939 1.71212 -1.25450 0.45761
magnitude: 0.79633 au
magnitude: 2.02411 debye
