program: Orca
programVersion: 5.0.2
elementType: O O O C C C C C C C C C C C C C C C C C C C C C C C H H H H H H H H H H H H H H H H H H H H H H H H H H
charge: 0
multiplicity: 1
keywords: wb97x-d3
keywords: def2-TZVPP
keywords: def2/J RIJCOSX
keywords: DEFGRID2
keywords: scfconv7
keywords: smallprint printgap noloewdin
keywords: NOSOSCF
formula: C23H26O3
InChI: InChI=1/C23H26O3/c1-16(2)13-20-21(23(20,3)4)22(24)25-15-17-9-8-12-19(14-17)26-18-10-6-5-7-11-18/h5-14,20-21H,15H2,1-4H3
52 atoms
O  0.437102 -2.83588 -1.192137
O  0.057575 -2.73169 1.005688
O  1.864887 1.973076 -0.894696
C  -2.957393 -3.042373 0.217307
C  -2.645206 -1.588862 0.293054
C  -1.757832 -2.507427 -0.545027
C  -4.098979 -3.507047 -0.656137
C  -2.779778 -3.891242 1.452414
C  -3.465328 -0.543659 -0.36615
C  -0.362138 -2.708248 -0.126783
C  -3.057869 0.704643 -0.613852
C  -3.967689 1.706356 -1.256683
C  -1.686191 1.209265 -0.287983
C  1.841139 -2.888975 -0.953144
C  2.389417 -1.588252 -0.433015
C  1.86521 -0.37442 -0.86559
C  3.445592 -1.592299 0.469065
C  2.397032 0.815663 -0.395394
C  3.983639 -0.393573 0.916843
C  3.467817 0.819686 0.489978
C  1.515552 3.000658 -0.06655
C  1.467127 4.263653 -0.64499
C  1.162665 2.822939 1.266326
C  1.062808 5.350939 0.114095
C  0.770052 3.924101 2.015671
C  0.7169 5.189714 1.449268
H  -2.172004 -1.285855 1.223441
H  -1.894308 -2.438679 -1.618151
H  -5.050602 -3.426576 -0.126597
H  -3.963243 -4.554789 -0.931039
H  -4.18311 -2.936363 -1.580864
H  -2.028252 -3.503417 2.135571
H  -2.503699 -4.915011 1.191911
H  -3.724102 -3.936756 1.998972
H  -4.477623 -0.817912 -0.648821
H  -4.106082 2.580441 -0.614832
H  -4.951323 1.289701 -1.473728
H  -3.54345 2.076972 -2.193738
H  -1.741401 2.063757 0.391589
H  -1.186374 1.568661 -1.191295
H  -1.046968 0.457454 0.172338
H  2.2751 -3.118977 -1.927065
H  2.092906 -3.711202 -0.279796
H  1.040338 -0.340699 -1.567541
H  3.849733 -2.532254 0.824471
H  4.812137 -0.40244 1.613256
H  3.892732 1.750467 0.844042
H  1.739643 4.388082 -1.685766
H  1.181122 1.842651 1.724963
H  1.023875 6.331236 -0.343384
H  0.496345 3.782218 3.053376
H  0.405805 6.040807 2.040469
elementType: O C H
totalener: -1117.86898548 hartree
nucrepener: 2307.83467223 hartree
electener: -3425.70365771 hartree
oneelecener: -6105.48406245 hartree
twoeener: 2679.78040474 hartree
cpcmener: -0.02430731 hartree
kineticenergy: 1112.80672219 hartree
xcener: -110.229569981135 hartree
chargesum: -0.0000000
charge: -0.294227 -0.465493 -0.327985 0.170180 -0.045377 -0.069444 -0.295477 -0.277384 -0.277422 0.358122 0.010385 -0.232092 -0.264916 0.099182 0.045542 -0.294549 -0.209613 0.275270 -0.124986 -0.209123 0.321129 -0.257298 -0.220806 -0.119881 -0.149324 -0.190577 0.104151 0.089568 0.100755 0.098630 0.089854 0.093825 0.097926 0.093287 0.122363 0.095548 0.089299 0.095100 0.102223 0.096334 0.076426 0.120418 0.114767 0.141846 0.139780 0.158375 0.155436 0.144390 0.152943 0.156492 0.158634 0.157790
qa: -0.2942 -0.4655 -0.3280 0.1702 -0.0454 -0.0694 -0.2955 -0.2774 -0.2774 0.3581 0.0104 -0.2321 -0.2649 0.0992 0.0455 -0.2945 -0.2096 0.2753 -0.1250 -0.2091 0.3211 -0.2573 -0.2208 -0.1199 -0.1493 -0.1906 0.1042 0.0896 0.1008 0.0986 0.0899 0.0938 0.0979 0.0933 0.1224 0.0955 0.0893 0.0951 0.1022 0.0963 0.0764 0.1204 0.1148 0.1418 0.1398 0.1584 0.1554 0.1444 0.1529 0.1565 0.1586 0.1578
va: 2.1078 2.0352 2.0445 3.7124 3.8341 3.7950 3.9161 3.8786 3.8894 4.1669 3.7519 3.9260 3.9497 3.7993 3.6291 4.0245 3.9749 3.7361 3.8891 3.9493 3.5903 4.0089 3.8505 3.8921 3.9009 3.9083 1.0218 1.0349 0.9988 1.0025 1.0012 1.0207 0.9996 1.0009 1.0026 0.9959 1.0068 0.9964 0.9975 0.9977 1.0058 0.9921 1.0091 1.0179 1.0033 0.9898 0.9965 1.0096 1.0035 0.9894 0.9899 0.9902
dispcorr: -0.027238907 hartree
energy: -1117.896224386705
dipole: -22.64013 22.44813 -0.19200 -3.63580 3.76882 0.13301 0.85217 -1.22841 -0.37624
magnitude: 0.44284 au
magnitude: 1.12562 debye
