program: Orca
programVersion: 5.0.2
elementType: O O O C C C C C C C C C C C C C C C C C C C C C C C H H H H H H H H H H H H H H H H H H H H H H H H H H
charge: 0
multiplicity: 1
keywords: wb97x-d3
keywords: def2-TZVPP
keywords: def2/J RIJCOSX
keywords: DEFGRID2
keywords: scfconv7
keywords: smallprint printgap noloewdin
keywords: NOSOSCF
formula: C23H26O3
InChI: InChI=1/C23H26O3/c1-16(2)13-20-21(23(20,3)4)22(24)25-15-17-9-8-12-19(14-17)26-18-10-6-5-7-11-18/h5-14,20-21H,15H2,1-4H3
52 atoms
O  0.375614 -1.696357 -1.370798
O  -0.017405 -2.716043 0.577221
O  2.700008 2.27875 0.929816
C  -2.975938 -2.569417 -0.575469
C  -2.787134 -1.601423 0.554862
C  -1.798188 -1.60723 -0.584846
C  -4.057239 -2.2956 -1.591506
C  -2.757173 -4.039192 -0.318577
C  -3.661963 -0.41811 0.738228
C  -0.416302 -2.07515 -0.36529
C  -4.599944 -0.284374 1.680257
C  -5.412259 0.970346 1.789532
C  -4.928979 -1.341158 2.689491
C  1.762051 -2.019644 -1.280181
C  2.479597 -1.189263 -0.251917
C  2.235436 0.178548 -0.168787
C  3.408059 -1.77877 0.596285
C  2.929898 0.944329 0.757037
C  4.098478 -1.001154 1.515634
C  3.867447 0.361451 1.60098
C  2.331244 3.067573 -0.126144
C  3.000295 3.025725 -1.34369
C  1.297256 3.968411 0.083869
C  2.616931 3.892645 -2.356181
C  0.932785 4.838572 -0.93384
C  1.584867 4.800898 -2.158263
H  -2.416991 -2.056672 1.468804
H  -1.882497 -0.797465 -1.302379
H  -5.023304 -2.64717 -1.222513
H  -3.850584 -2.819145 -2.527076
H  -4.159946 -1.235785 -1.822893
H  -3.704425 -4.510774 -0.049359
H  -2.057733 -4.233239 0.492007
H  -2.384519 -4.543749 -1.212736
H  -3.516546 0.403866 0.042678
H  -5.290023 1.433111 2.772625
H  -6.479474 0.760219 1.67907
H  -5.134369 1.707563 1.036136
H  -4.348832 -2.253894 2.5669
H  -5.985919 -1.612349 2.625941
H  -4.768263 -0.973878 3.706211
H  2.154872 -1.812135 -2.276185
H  1.903032 -3.084917 -1.086937
H  1.502617 0.640203 -0.81996
H  3.589531 -2.84499 0.541973
H  4.821672 -1.460789 2.176747
H  4.399914 0.971545 2.319749
H  3.814634 2.32979 -1.502654
H  0.7881 3.990996 1.039365
H  3.136785 3.860577 -3.305041
H  0.129034 5.544152 -0.767247
H  1.2950 5.477195 -2.951635
elementType: O C H
totalener: -1117.86989526 hartree
nucrepener: 2220.74731927 hartree
electener: -3338.61721452 hartree
oneelecener: -5931.35513170 hartree
twoeener: 2592.73791718 hartree
cpcmener: -0.02610151 hartree
kineticenergy: 1112.80980565 hartree
xcener: -110.227261563066 hartree
chargesum: -0.0000000
charge: -0.290969 -0.464252 -0.329632 0.142271 0.001926 -0.128082 -0.263528 -0.290431 -0.266256 0.397966 -0.033407 -0.227297 -0.250584 0.102290 0.024176 -0.227823 -0.224511 0.276776 -0.109414 -0.257771 0.277292 -0.192092 -0.242945 -0.142385 -0.123958 -0.183418 0.095522 0.089936 0.095619 0.097681 0.089876 0.095198 0.092616 0.100256 0.118558 0.093858 0.093207 0.088006 0.087690 0.094841 0.097784 0.121827 0.112946 0.139448 0.140859 0.157283 0.146072 0.155637 0.146413 0.159125 0.157818 0.157982
qa: -0.2910 -0.4643 -0.3296 0.1423 0.0019 -0.1281 -0.2635 -0.2904 -0.2663 0.3980 -0.0334 -0.2273 -0.2506 0.1023 0.0242 -0.2278 -0.2245 0.2768 -0.1094 -0.2578 0.2773 -0.1921 -0.2429 -0.1424 -0.1240 -0.1834 0.0955 0.0899 0.0956 0.0977 0.0899 0.0952 0.0926 0.1003 0.1186 0.0939 0.0932 0.0880 0.0877 0.0948 0.0978 0.1218 0.1129 0.1394 0.1409 0.1573 0.1461 0.1556 0.1464 0.1591 0.1578 0.1580
va: 2.1133 2.0455 2.0767 3.6842 3.7734 3.8690 3.9048 3.9047 3.8749 4.1867 3.7089 3.9272 3.9433 3.8016 3.6493 3.9234 3.9655 3.7259 3.8951 4.0094 3.7011 3.9214 4.0098 3.8904 3.8815 3.9045 1.0270 1.0379 1.0030 1.0031 1.0031 1.0010 1.0185 0.9994 1.0082 0.9954 0.9963 1.0083 1.0085 0.9975 0.9978 0.9910 1.0097 1.0174 1.0039 0.9890 1.0071 0.9972 1.0078 0.9902 0.9893 0.9906
dispcorr: -0.023379653 hartree
energy: -1117.893274908310
dipole: -31.70069 31.10810 -0.59259 -9.33460 9.55557 0.22097 1.29802 -2.45528 -1.15725
magnitude: 1.31880 au
magnitude: 3.35212 debye
