program: Orca
programVersion: 5.0.2
elementType: O O O C C C C C C C C C C C C C C C C C C C C C C C H H H H H H H H H H H H H H H H H H H H H H H H H H
charge: 0
multiplicity: 1
keywords: wb97x-d3
keywords: def2-TZVPP
keywords: def2/J RIJCOSX
keywords: DEFGRID2
keywords: scfconv7
keywords: smallprint printgap noloewdin
keywords: NOSOSCF
formula: C23H26O3
InChI: InChI=1/C23H26O3/c1-16(2)13-20-21(23(20,3)4)22(24)25-15-17-9-8-12-19(14-17)26-18-10-6-5-7-11-18/h5-14,20-21H,15H2,1-4H3
52 atoms
O  0.255493 -1.605611 -1.40964
O  -0.04881 -2.743233 0.488386
O  2.638402 2.363208 0.944974
C  -3.039495 -2.698536 -0.518445
C  -2.847947 -1.711908 0.591491
C  -1.907239 -1.684084 -0.588103
C  -4.171432 -2.479416 -1.491029
C  -2.758324 -4.15684 -0.255361
C  -3.770421 -0.568806 0.81211
C  -0.497883 -2.07938 -0.415822
C  -4.815987 -0.585592 1.642798
C  -5.679097 0.623903 1.832551
C  -5.213486 -1.787925 2.441832
C  1.659963 -1.87149 -1.358606
C  2.354682 -1.083478 -0.283756
C  2.162392 0.292779 -0.201511
C  3.200077 -1.717243 0.618384
C  2.828071 1.021265 0.774423
C  3.859348 -0.977671 1.58997
C  3.681522 0.393743 1.672342
C  2.50378 3.202137 -0.125261
C  3.239367 3.050367 -1.294848
C  1.636639 4.2748 0.029489
C  3.089352 3.980668 -2.31368
C  1.507469 5.203692 -0.992829
C  2.227062 5.059264 -2.17064
H  -2.41611 -2.140774 1.491872
H  -2.064781 -0.886524 -1.306553
H  -3.988152 -3.018206 -2.423482
H  -4.316116 -1.427657 -1.739913
H  -5.110259 -2.851709 -1.073163
H  -2.033041 -4.320929 0.538922
H  -2.392604 -4.658231 -1.154383
H  -3.682503 -4.657304 0.041613
H  -3.564144 0.344614 0.261116
H  -6.719144 0.411279 1.570623
H  -5.34541 1.46697 1.227157
H  -5.684782 0.943459 2.878295
H  -4.58988 -2.65972 2.249409
H  -6.248437 -2.06745 2.226883
H  -5.171181 -1.576746 3.513934
H  2.025583 -1.578886 -2.343301
H  1.847687 -2.940885 -1.241758
H  1.493358 0.789915 -0.894503
H  3.340681 -2.789634 0.565557
H  4.516266 -1.472502 2.293458
H  4.191356 0.974122 2.431097
H  3.928141 2.224273 -1.418454
H  1.072789 4.384628 0.947311
H  3.661834 3.860473 -3.224474
H  0.833466 6.041096 -0.865956
H  2.119953 5.782423 -2.968352
elementType: O C H
totalener: -1117.86925200 hartree
nucrepener: 2205.52035682 hartree
electener: -3323.38960882 hartree
oneelecener: -5900.90731231 hartree
twoeener: 2577.51770349 hartree
cpcmener: -0.02561866 hartree
kineticenergy: 1112.80793031 hartree
xcener: -110.226343774960 hartree
chargesum: 0.0000000
charge: -0.291493 -0.468155 -0.329437 0.127037 -0.016827 -0.112840 -0.271871 -0.295611 -0.247194 0.403162 -0.041379 -0.228862 -0.248801 0.101385 0.028794 -0.239477 -0.213995 0.277459 -0.113119 -0.252954 0.296901 -0.200783 -0.257968 -0.141770 -0.116935 -0.191720 0.100931 0.090239 0.099156 0.091731 0.096340 0.093837 0.102134 0.095504 0.119547 0.093094 0.089368 0.094262 0.086480 0.095313 0.101483 0.123772 0.113545 0.140345 0.141117 0.157321 0.146733 0.155250 0.145473 0.158706 0.157611 0.157163
qa: -0.2915 -0.4682 -0.3294 0.1270 -0.0168 -0.1128 -0.2719 -0.2956 -0.2472 0.4032 -0.0414 -0.2289 -0.2488 0.1014 0.0288 -0.2395 -0.2140 0.2775 -0.1131 -0.2530 0.2969 -0.2008 -0.2580 -0.1418 -0.1169 -0.1917 0.1009 0.0902 0.0992 0.0917 0.0963 0.0938 0.1021 0.0955 0.1195 0.0931 0.0894 0.0943 0.0865 0.0953 0.1015 0.1238 0.1135 0.1403 0.1411 0.1573 0.1467 0.1553 0.1455 0.1587 0.1576 0.1572
va: 2.1152 2.0421 2.0772 3.6786 3.7981 3.8474 3.9072 3.9002 3.8557 4.1920 3.7086 3.9286 3.9380 3.8011 3.6310 3.9454 3.9541 3.7223 3.8962 4.0127 3.6902 3.9112 4.0106 3.8909 3.8820 3.9105 1.0246 1.0365 1.0031 1.0027 1.0011 1.0190 0.9995 1.0004 1.0070 0.9965 1.0075 0.9955 1.0084 0.9979 0.9986 0.9913 1.0084 1.0155 1.0050 0.9893 1.0065 0.9979 1.0090 0.9903 0.9891 0.9910
dispcorr: -0.023556187 hartree
energy: -1117.892808185709
dipole: -32.26706 31.70349 -0.56357 -11.17506 11.34181 0.16674 1.35149 -2.42993 -1.07844
magnitude: 1.22819 au
magnitude: 3.12181 debye
