program: Orca
programVersion: 5.0.2
elementType: O O O C C C C C C C C C C C C C C C C C C C C C C C H H H H H H H H H H H H H H H H H H H H H H H H H H
charge: 0
multiplicity: 1
keywords: wb97x-d3
keywords: def2-TZVPP
keywords: def2/J RIJCOSX
keywords: DEFGRID2
keywords: scfconv7
keywords: smallprint printgap noloewdin
keywords: NOSOSCF
formula: C23H26O3
InChI: InChI=1/C23H26O3/c1-16(2)13-20-21(23(20,3)4)22(24)25-15-17-9-8-12-19(14-17)26-18-10-6-5-7-11-18/h5-14,20-21H,15H2,1-4H3
52 atoms
O  0.211518 -1.567094 -1.401912
O  -0.094248 -2.803509 0.433144
O  2.629492 2.424629 0.920483
C  -3.082257 -2.711411 -0.587171
C  -2.899594 -1.789145 0.578783
C  -1.952135 -1.692526 -0.592479
C  -4.207031 -2.441235 -1.555416
C  -2.797488 -4.180416 -0.398196
C  -3.82375 -0.662977 0.862921
C  -0.542042 -2.093811 -0.435633
C  -4.813154 -0.697845 1.759829
C  -5.674592 0.501389 2.015251
C  -5.146172 -1.908072 2.577535
C  1.619825 -1.814915 -1.35511
C  2.295829 -1.034102 -0.262765
C  2.142673 0.348608 -0.212356
C  3.074696 -1.677794 0.690726
C  2.782957 1.074389 0.782045
C  3.708431 -0.941358 1.681742
C  3.570903 0.436022 1.731323
C  2.565037 3.246793 -0.169403
C  3.33795 3.047296 -1.307424
C  1.729972 4.351358 -0.067882
C  3.257637 3.961313 -2.348357
C  1.670986 5.263535 -1.111085
C  2.428129 5.070801 -2.258221
H  -2.471942 -2.268994 1.454766
H  -2.105197 -0.855253 -1.265378
H  -4.013074 -2.923666 -2.515445
H  -4.353517 -1.378065 -1.743737
H  -5.147406 -2.840347 -1.169203
H  -2.068913 -4.379238 0.384684
H  -2.432878 -4.636195 -1.321246
H  -3.718973 -4.69732 -0.122147
H  -3.66602 0.255477 0.304443
H  -6.725918 0.283482 1.808879
H  -5.381818 1.356184 1.405292
H  -5.623596 0.804725 3.064533
H  -6.194648 -2.185812 2.440827
H  -5.019913 -1.706083 3.64478
H  -4.540658 -2.778302 2.328351
H  1.982645 -1.497963 -2.332858
H  1.823658 -2.88276 -1.256923
H  1.524295 0.852108 -0.946617
H  3.183867 -2.754679 0.662021
H  4.31461 -1.443177 2.424684
H  4.062539 1.015309 2.50272
H  4.002487 2.196238 -1.387776
H  1.136047 4.496703 0.825976
H  3.85948 3.804389 -3.234283
H  1.020943 6.124906 -1.026096
H  2.375539 5.780519 -3.073313
elementType: O C H
totalener: -1117.86945425 hartree
nucrepener: 2199.96120913 hartree
electener: -3317.83066338 hartree
oneelecener: -5889.76650371 hartree
twoeener: 2571.93584033 hartree
cpcmener: -0.02543416 hartree
kineticenergy: 1112.81026001 hartree
xcener: -110.226715516297 hartree
chargesum: -0.0000000
charge: -0.290189 -0.468587 -0.329420 0.141598 -0.013217 -0.128097 -0.267447 -0.295928 -0.253890 0.407509 -0.037036 -0.229089 -0.250821 0.097373 0.023534 -0.239605 -0.206910 0.278915 -0.115953 -0.251928 0.298628 -0.202245 -0.257634 -0.142254 -0.116731 -0.192104 0.098999 0.090158 0.098591 0.090810 0.095521 0.093673 0.101086 0.095322 0.119702 0.093401 0.089165 0.094085 0.095201 0.100189 0.087131 0.125188 0.113044 0.140392 0.141278 0.157271 0.146661 0.155609 0.145379 0.158887 0.157380 0.157406
qa: -0.2902 -0.4686 -0.3294 0.1416 -0.0132 -0.1281 -0.2674 -0.2959 -0.2539 0.4075 -0.0370 -0.2291 -0.2508 0.0974 0.0235 -0.2396 -0.2069 0.2789 -0.1160 -0.2519 0.2986 -0.2022 -0.2576 -0.1423 -0.1167 -0.1921 0.0990 0.0902 0.0986 0.0908 0.0955 0.0937 0.1011 0.0953 0.1197 0.0934 0.0892 0.0941 0.0952 0.1002 0.0871 0.1252 0.1130 0.1404 0.1413 0.1573 0.1467 0.1556 0.1454 0.1589 0.1574 0.1574
va: 2.1153 2.0419 2.0780 3.6730 3.7864 3.8662 3.9066 3.9021 3.8653 4.1865 3.7061 3.9281 3.9409 3.8042 3.6291 3.9470 3.9465 3.7216 3.9000 4.0112 3.6886 3.9114 4.0096 3.8920 3.8827 3.9106 1.0247 1.0373 1.0030 1.0029 1.0024 1.0190 0.9996 1.0006 1.0076 0.9964 1.0078 0.9953 0.9979 0.9981 1.0080 0.9918 1.0087 1.0148 1.0061 0.9894 1.0065 0.9977 1.0089 0.9903 0.9892 0.9909
dispcorr: -0.023372891 hartree
energy: -1117.892827143560
dipole: -32.05589 31.53722 -0.51867 -11.55816 11.76853 0.21037 1.64914 -2.68080 -1.03167
magnitude: 1.17371 au
magnitude: 2.98334 debye
