program: Orca
programVersion: 5.0.2
elementType: O O O C C C C C C C C C C C C C C C C C C C C C C C H H H H H H H H H H H H H H H H H H H H H H H H H H
charge: 0
multiplicity: 1
keywords: wb97x-d3
keywords: def2-TZVPP
keywords: def2/J RIJCOSX
keywords: DEFGRID2
keywords: scfconv7
keywords: smallprint printgap noloewdin
keywords: NOSOSCF
formula: C23H26O3
InChI: InChI=1/C23H26O3/c1-16(2)13-20-21(23(20,3)4)22(24)25-15-17-9-8-12-19(14-17)26-18-10-6-5-7-11-18/h5-14,20-21H,15H2,1-4H3
52 atoms
O  -0.964291 -1.424807 -1.328404
O  -2.166539 0.079357 -0.192041
O  3.598253 2.490761 -0.884489
C  -3.078149 -2.465377 1.416447
C  -4.131365 -2.110241 0.424923
C  -2.695656 -2.254256 -0.042659
C  -2.980526 -3.891812 1.901346
C  -2.68178 -1.456575 2.466473
C  -5.155144 -3.091068 -0.022934
C  -1.948637 -1.069137 -0.49531
C  -5.617235 -3.211505 -1.270258
C  -6.660135 -4.229045 -1.619585
C  -5.145918 -2.366717 -2.413803
C  -0.118613 -0.408005 -1.844981
C  0.989721 -0.024532 -0.900724
C  1.765423 1.081561 -1.231927
C  1.294028 -0.754172 0.242561
C  2.846622 1.441145 -0.44201
C  2.370583 -0.374098 1.03386
C  3.160806 0.714444 0.701369
C  4.251025 3.305217 0.0009
C  3.612271 3.841393 1.11237
C  5.566703 3.636254 -0.28973
C  4.308861 4.711164 1.938431
C  6.24764 4.517143 0.53896
C  5.625142 5.0541 1.65707
H  -4.468571 -1.07742 0.480214
H  -2.462658 -3.162404 -0.587228
H  -3.22103 -4.618058 1.124679
H  -3.661789 -4.062259 2.737559
H  -1.969916 -4.108483 2.253106
H  -1.623635 -1.546684 2.721662
H  -3.253788 -1.636738 3.379211
H  -2.86828 -0.427874 2.166742
H  -5.566865 -3.74299 0.743286
H  -7.560106 -3.751038 -2.015748
H  -6.951282 -4.833727 -0.760502
H  -6.302022 -4.904827 -2.401043
H  -5.992655 -1.877808 -2.902873
H  -4.665048 -2.982692 -3.179011
H  -4.442571 -1.59041 -2.11801
H  -0.695314 0.471399 -2.1394
H  0.308298 -0.832241 -2.754819
H  1.536973 1.664906 -2.117602
H  0.712356 -1.621962 0.525002
H  2.607733 -0.946523 1.921565
H  4.007492 0.980402 1.321202
H  2.581922 3.589729 1.332019
H  6.049566 3.211881 -1.161366
H  3.812693 5.12915 2.804857
H  7.272783 4.778108 0.308798
H  6.159856 5.737645 2.303413
elementType: O C H
totalener: -1117.86933135 hartree
nucrepener: 2154.58122406 hartree
electener: -3272.45055541 hartree
oneelecener: -5798.70754422 hartree
twoeener: 2526.25698881 hartree
cpcmener: -0.02492772 hartree
kineticenergy: 1112.78915344 hartree
xcener: -110.225402788442 hartree
chargesum: 0.0000000
charge: -0.296572 -0.466246 -0.327921 0.150991 -0.016463 -0.101061 -0.285008 -0.276726 -0.293727 0.367981 -0.014161 -0.227190 -0.240517 0.088213 0.045716 -0.277354 -0.222382 0.277628 -0.143088 -0.199164 0.271615 -0.188303 -0.237332 -0.145553 -0.126337 -0.179731 0.104241 0.095213 0.092937 0.098290 0.096814 0.095221 0.095500 0.094862 0.120942 0.096223 0.088926 0.093311 0.101092 0.099015 0.083075 0.115081 0.129758 0.129314 0.144319 0.156974 0.154265 0.158185 0.145108 0.159046 0.156899 0.158080
qa: -0.2966 -0.4662 -0.3279 0.1510 -0.0165 -0.1011 -0.2850 -0.2767 -0.2937 0.3680 -0.0142 -0.2272 -0.2405 0.0882 0.0457 -0.2774 -0.2224 0.2776 -0.1431 -0.1992 0.2716 -0.1883 -0.2373 -0.1456 -0.1263 -0.1797 0.1042 0.0952 0.0929 0.0983 0.0968 0.0952 0.0955 0.0949 0.1209 0.0962 0.0889 0.0933 0.1011 0.0990 0.0831 0.1151 0.1298 0.1293 0.1443 0.1570 0.1543 0.1582 0.1451 0.1590 0.1569 0.1581
va: 2.1063 2.0351 2.0722 3.6987 3.8335 3.8054 3.9082 3.8855 3.8928 4.1434 3.7116 3.9311 3.9367 3.8085 3.6599 4.0832 3.9407 3.7363 3.9262 3.9077 3.6975 3.9176 4.0066 3.8910 3.8859 3.8998 1.0251 1.0309 1.0021 1.0002 1.0034 1.0012 1.0022 1.0189 1.0034 0.9962 1.0064 0.9968 0.9994 0.9986 1.0117 1.0163 0.9898 1.0191 1.0097 0.9925 0.9975 0.9961 1.0079 0.9903 0.9896 0.9904
dispcorr: -0.023745120 hartree
energy: -1117.893076470380
dipole: -28.64947 28.73964 0.09017 -20.99305 19.99500 -0.99805 3.71057 -3.60896 0.10161
magnitude: 1.00725 au
magnitude: 2.56023 debye
