program: Orca
programVersion: 5.0.2
elementType: O O O C C C C C C C C C C C C C C C C C C C C C C C H H H H H H H H H H H H H H H H H H H H H H H H H H
charge: 0
multiplicity: 1
keywords: wb97x-d3
keywords: def2-TZVPP
keywords: def2/J RIJCOSX
keywords: DEFGRID2
keywords: scfconv7
keywords: smallprint printgap noloewdin
keywords: NOSOSCF
formula: C23H26O3
InChI: InChI=1/C23H26O3/c1-16(2)13-20-21(23(20,3)4)22(24)25-15-17-9-8-12-19(14-17)26-18-10-6-5-7-11-18/h5-14,20-21H,15H2,1-4H3
52 atoms
O  -0.028755 -2.001119 -0.311844
O  0.263926 -1.667435 1.873473
O  3.455957 1.698839 -0.688857
C  -2.15415 0.227123 -0.111063
C  -2.816531 -1.118894 -0.118172
C  -1.707036 -0.836381 0.877851
C  -2.884294 1.405024 0.489771
C  -1.306907 0.621185 -1.29577
C  -4.190028 -1.319756 0.390804
C  -0.403583 -1.527347 0.875227
C  -5.220701 -1.84635 -0.278112
C  -6.565426 -1.982805 0.371381
C  -5.160133 -2.334267 -1.693065
C  1.223922 -2.676735 -0.390437
C  2.41127 -1.774123 -0.192195
C  2.35677 -0.429537 -0.53292
C  3.59928 -2.3101 0.295162
C  3.475241 0.373022 -0.352728
C  4.71965 -1.505431 0.436791
C  4.664298 -0.154251 0.127004
C  2.373522 2.461919 -0.342503
C  1.928829 3.394851 -1.268572
C  1.767468 2.356958 0.904535
C  0.874131 4.235127 -0.93941
C  0.70778 3.196634 1.215442
C  0.255125 4.136916 0.29873
H  -2.527479 -1.747145 -0.953727
H  -2.038259 -0.651348 1.89428
H  -3.427444 1.153646 1.399976
H  -3.603209 1.813012 -0.224301
H  -2.180174 2.201846 0.738111
H  -1.925413 1.162926 -2.014786
H  -0.874292 -0.226221 -1.821934
H  -0.497805 1.292051 -0.997031
H  -4.367728 -0.99332 1.411862
H  -7.329668 -1.437818 -0.189367
H  -6.56929 -1.607883 1.394838
H  -6.888176 -3.027309 0.395004
H  -4.180105 -2.22705 -2.155129
H  -5.876599 -1.79035 -2.314729
H  -5.443151 -3.388887 -1.752101
H  1.239755 -3.102323 -1.394599
H  1.255347 -3.508889 0.316787
H  1.448513 0.002454 -0.934051
H  3.647952 -3.357184 0.56857
H  5.641081 -1.927419 0.816853
H  5.529504 0.483087 0.259179
H  2.410436 3.466228 -2.235924
H  2.115398 1.634508 1.632511
H  0.531237 4.96395 -1.662604
H  0.238295 3.116984 2.187559
H  -0.570126 4.790138 0.550063
elementType: O C H
totalener: -1117.86797345 hartree
nucrepener: 2316.55648279 hartree
electener: -3434.42445625 hartree
oneelecener: -6122.53443478 hartree
twoeener: 2688.10997854 hartree
cpcmener: -0.02675481 hartree
kineticenergy: 1112.79723926 hartree
xcener: -110.229811201318 hartree
chargesum: 0.0000000
charge: -0.285070 -0.461394 -0.333282 0.144210 0.055938 -0.110655 -0.272157 -0.273962 -0.299351 0.392944 -0.040745 -0.221686 -0.252425 0.058787 0.022583 -0.198945 -0.219462 0.224330 -0.120506 -0.235067 0.245634 -0.211762 -0.145076 -0.128656 -0.181453 -0.177709 0.100801 0.086224 0.090697 0.097341 0.091222 0.107730 0.099268 0.041942 0.117604 0.092789 0.087858 0.092992 0.088085 0.095516 0.095482 0.120298 0.120091 0.185089 0.140037 0.155967 0.146105 0.143838 0.151845 0.156696 0.160775 0.158646
qa: -0.2851 -0.4614 -0.3333 0.1442 0.0559 -0.1107 -0.2722 -0.2740 -0.2994 0.3929 -0.0407 -0.2217 -0.2524 0.0588 0.0226 -0.1989 -0.2195 0.2243 -0.1205 -0.2351 0.2456 -0.2118 -0.1451 -0.1287 -0.1815 -0.1777 0.1008 0.0862 0.0907 0.0973 0.0912 0.1077 0.0993 0.0419 0.1176 0.0928 0.0879 0.0930 0.0881 0.0955 0.0955 0.1203 0.1201 0.1851 0.1400 0.1560 0.1461 0.1438 0.1518 0.1567 0.1608 0.1586
va: 2.1106 2.0368 2.0749 3.6061 3.7633 3.8698 3.9114 3.9039 3.8678 4.1807 3.7513 3.9235 3.9437 3.8204 3.6280 3.8991 3.9734 3.7862 3.8964 4.0006 3.7194 3.9627 3.8336 3.8810 3.8578 3.8475 1.0244 1.0369 1.0072 1.0029 1.0096 1.0043 1.0127 1.0223 1.0107 0.9964 1.0089 0.9961 1.0104 0.9974 0.9968 0.9933 1.0077 0.9746 1.0012 0.9890 1.0058 1.0076 1.0015 0.9893 0.9907 0.9902
dispcorr: -0.028047094 hartree
energy: -1117.896020547819
dipole: -32.06280 30.92165 -1.14115 -2.53079 2.36910 -0.16170 -4.34167 3.31414 -1.02753
magnitude: 1.54409 au
magnitude: 3.92476 debye
