program: Orca
programVersion: 5.0.2
elementType: O O O C C C C C C C C C C C C C C C C C C C C C C C H H H H H H H H H H H H H H H H H H H H H H H H H H
charge: 0
multiplicity: 1
keywords: wb97x-d3
keywords: def2-TZVPP
keywords: def2/J RIJCOSX
keywords: DEFGRID2
keywords: scfconv7
keywords: smallprint printgap noloewdin
keywords: NOSOSCF
formula: C23H26O3
InChI: InChI=1/C23H26O3/c1-16(2)13-20-21(23(20,3)4)22(24)25-15-17-9-8-12-19(14-17)26-18-10-6-5-7-11-18/h5-14,20-21H,15H2,1-4H3
52 atoms
O  0.198065 -2.322087 0.542907
O  0.668759 -2.570875 -1.622432
O  2.838697 2.081968 0.642869
C  -2.736082 -2.576052 -0.444692
C  -2.397626 -1.179526 -0.013742
C  -1.5124 -1.888803 -1.024335
C  -3.871066 -2.815262 -1.411893
C  -2.590439 -3.69253 0.560786
C  -3.169948 0.002115 -0.442685
C  -0.11997 -2.293328 -0.749326
C  -3.4471 1.085136 0.292258
C  -4.244812 2.215825 -0.286083
C  -2.999251 1.303096 1.705688
C  1.544503 -2.653216 0.884066
C  2.509169 -1.565854 0.501972
C  2.190654 -0.234585 0.74823
C  3.732548 -1.887889 -0.073034
C  3.088381 0.761682 0.391474
C  4.633209 -0.884104 -0.397411
C  4.313489 0.446792 -0.179207
C  1.617369 2.629991 0.368815
C  0.825081 2.220207 -0.697979
C  1.21791 3.683507 1.181094
C  -0.371885 2.879178 -0.944142
C  0.025723 4.339543 0.915083
C  -0.775647 3.94122 -0.146268
H  -1.977088 -1.121543 0.983263
H  -1.63171 -1.577624 -2.056709
H  -4.829153 -2.820439 -0.887796
H  -3.756008 -3.786696 -1.897007
H  -3.928048 -2.065883 -2.200488
H  -3.552886 -3.875336 1.043352
H  -1.873305 -3.476172 1.349533
H  -2.288836 -4.622876 0.074456
H  -3.539549 -0.01542 -1.463962
H  -5.178212 2.359638 0.265344
H  -4.49614 2.052665 -1.334197
H  -3.699515 3.160509 -0.213221
H  -3.834762 1.631142 2.328601
H  -2.251324 2.100288 1.749184
H  -2.567041 0.421541 2.174857
H  1.835428 -3.606442 0.438034
H  1.525439 -2.787362 1.965976
H  1.246248 0.025809 1.212304
H  3.97913 -2.923275 -0.273074
H  5.585943 -1.136773 -0.844347
H  5.005021 1.235476 -0.447382
H  1.131411 1.404933 -1.34134
H  1.844096 3.991509 2.009218
H  -0.987757 2.560435 -1.775434
H  -0.277955 5.164831 1.546265
H  -1.705086 4.45557 -0.351464
elementType: O C H
totalener: -1117.86827571 hartree
nucrepener: 2339.61959828 hartree
electener: -3457.48787400 hartree
oneelecener: -6168.69368747 hartree
twoeener: 2711.20581348 hartree
cpcmener: -0.02711106 hartree
kineticenergy: 1112.80549115 hartree
xcener: -110.230357751083 hartree
chargesum: -0.0000000
charge: -0.285242 -0.463051 -0.329898 0.089620 0.085912 -0.105677 -0.278009 -0.272351 -0.295675 0.405509 -0.068997 -0.218649 -0.250081 0.074590 0.051998 -0.236580 -0.226020 0.270680 -0.110363 -0.251319 0.306212 -0.190776 -0.260578 -0.138250 -0.101395 -0.233133 0.097085 0.087975 0.097500 0.097403 0.088313 0.094959 0.091008 0.100127 0.114980 0.101959 0.089940 0.085928 0.100015 0.090458 0.092486 0.117103 0.117964 0.144292 0.140409 0.157371 0.146095 0.152704 0.144360 0.158736 0.156256 0.166096
qa: -0.2852 -0.4631 -0.3299 0.0896 0.0859 -0.1057 -0.2780 -0.2724 -0.2957 0.4055 -0.0690 -0.2186 -0.2501 0.0746 0.0520 -0.2366 -0.2260 0.2707 -0.1104 -0.2513 0.3062 -0.1908 -0.2606 -0.1383 -0.1014 -0.2331 0.0971 0.0880 0.0975 0.0974 0.0883 0.0950 0.0910 0.1001 0.1150 0.1020 0.0899 0.0859 0.1000 0.0905 0.0925 0.1171 0.1180 0.1443 0.1404 0.1574 0.1461 0.1527 0.1444 0.1587 0.1563 0.1661
va: 2.1047 2.0429 2.0789 3.7367 3.6863 3.8248 3.9157 3.9058 3.8491 4.1636 3.7751 3.9120 3.9310 3.8188 3.6045 3.9363 3.9747 3.7233 3.8871 4.0205 3.6791 3.8859 4.0186 3.8326 3.8609 3.8737 1.0238 1.0326 1.0009 1.0010 1.0074 1.0002 1.0145 0.9998 1.0131 0.9982 1.0088 0.9983 0.9998 0.9984 1.0105 1.0069 0.9945 1.0123 1.0036 0.9890 1.0062 1.0025 1.0089 0.9926 0.9897 0.9846
dispcorr: -0.028030216 hartree
energy: -1117.896305930823
dipole: -28.18235 27.08534 -1.09701 -2.94125 2.85091 -0.09034 1.64464 -0.70223 0.94242
magnitude: 1.44904 au
magnitude: 3.68318 debye
