program: Orca
programVersion: 5.0.2
elementType: O O O C C C C C C C C C C C C C C C C C C C C C C C H H H H H H H H H H H H H H H H H H H H H H H H H H
charge: 0
multiplicity: 1
keywords: wb97x-d3
keywords: def2-TZVPP
keywords: def2/J RIJCOSX
keywords: DEFGRID2
keywords: scfconv7
keywords: smallprint printgap noloewdin
keywords: NOSOSCF
formula: C23H26O3
InChI: InChI=1/C23H26O3/c1-16(2)13-20-21(23(20,3)4)22(24)25-15-17-9-8-12-19(14-17)26-18-10-6-5-7-11-18/h5-14,20-21H,15H2,1-4H3
52 atoms
O  0.327422 -2.037971 0.210532
O  -0.884486 -2.398133 2.055896
O  3.475982 2.356827 -0.257023
C  -3.086054 -3.235078 -0.020738
C  -3.330852 -1.823216 0.393075
C  -1.950818 -2.225198 -0.084239
C  -3.591962 -3.703501 -1.36379
C  -3.101665 -4.31879 1.027707
C  -4.165128 -0.901025 -0.420571
C  -0.818758 -2.239909 0.858997
C  -3.861812 0.359521 -0.740588
C  -4.793718 1.194088 -1.565389
C  -2.59857 1.051368 -0.328485
C  1.551114 -1.987583 0.959154
C  2.508928 -1.158819 0.159332
C  2.527344 0.219528 0.34319
C  3.341558 -1.742555 -0.788377
C  3.372687 1.006906 -0.426593
C  4.187844 -0.946802 -1.547545
C  4.204095 0.428464 -1.377255
C  2.383172 3.089694 0.123647
C  2.556454 4.012881 1.144189
C  1.15957 2.966232 -0.523648
C  1.4942 4.824902 1.516978
C  0.103964 3.777653 -0.134164
C  0.264594 4.707858 0.884946
H  -3.398886 -1.68164 1.469837
H  -1.686124 -1.904484 -1.08552
H  -2.997194 -4.545655 -1.723449
H  -3.549403 -2.922782 -2.123649
H  -4.628217 -4.040862 -1.292063
H  -4.104137 -4.747001 1.091566
H  -2.840851 -3.959138 2.020313
H  -2.416555 -5.129569 0.771022
H  -5.118035 -1.299641 -0.759829
H  -4.303772 1.538769 -2.480086
H  -5.101629 2.092469 -1.023858
H  -5.693121 0.648683 -1.851467
H  -2.830782 1.9777 0.203366
H  -2.013103 1.338526 -1.20626
H  -1.961522 0.45217 0.318898
H  1.923656 -3.004646 1.100535
H  1.38381 -1.54636 1.942259
H  1.886908 0.666892 1.094626
H  3.33081 -2.815968 -0.931842
H  4.8381 -1.398537 -2.285413
H  4.861321 1.052411 -1.969951
H  3.517042 4.098576 1.636676
H  1.029597 2.251607 -1.32711
H  1.6309 5.547391 2.311296
H  -0.848605 3.687357 -0.640182
H  -0.56264 5.339725 1.180377
elementType: O C H
totalener: -1117.86847611 hartree
nucrepener: 2246.78059146 hartree
electener: -3364.64906757 hartree
oneelecener: -5982.71084428 hartree
twoeener: 2618.06177670 hartree
cpcmener: -0.02463736 hartree
kineticenergy: 1112.81537987 hartree
xcener: -110.226066729586 hartree
chargesum: -0.0000000
charge: -0.278153 -0.478783 -0.329648 0.141949 -0.001375 -0.130590 -0.282531 -0.285467 -0.286882 0.403376 -0.009808 -0.228661 -0.260600 0.068670 -0.032511 -0.163226 -0.204889 0.263354 -0.120243 -0.241007 0.273053 -0.238928 -0.189275 -0.123898 -0.148279 -0.185007 0.102419 0.097289 0.098535 0.092627 0.097188 0.093551 0.093070 0.098175 0.119425 0.093579 0.096206 0.089512 0.103850 0.099316 0.091211 0.120994 0.107249 0.141787 0.143191 0.157527 0.145633 0.146132 0.156858 0.157457 0.168820 0.157759
qa: -0.2782 -0.4788 -0.3296 0.1419 -0.0014 -0.1306 -0.2825 -0.2855 -0.2869 0.4034 -0.0098 -0.2287 -0.2606 0.0687 -0.0325 -0.1632 -0.2049 0.2634 -0.1202 -0.2410 0.2731 -0.2389 -0.1893 -0.1239 -0.1483 -0.1850 0.1024 0.0973 0.0985 0.0926 0.0972 0.0936 0.0931 0.0982 0.1194 0.0936 0.0962 0.0895 0.1039 0.0993 0.0912 0.1210 0.1072 0.1418 0.1432 0.1575 0.1456 0.1461 0.1569 0.1575 0.1688 0.1578
va: 2.1111 2.0269 2.0732 3.6957 3.7919 3.8490 3.9059 3.8991 3.8860 4.1310 3.7416 3.9270 3.9358 3.8189 3.7776 3.8757 3.9479 3.7323 3.9030 4.0069 3.7095 4.0071 3.9236 3.8892 3.8808 3.9227 1.0243 1.0289 1.0026 1.0029 1.0010 1.0012 1.0200 0.9987 1.0040 0.9971 0.9964 1.0066 0.9966 0.9964 1.0081 0.9950 1.0106 1.0081 1.0026 0.9889 1.0072 1.0075 0.9983 0.9890 0.9819 0.9921
dispcorr: -0.024902573 hartree
energy: -1117.893378684738
dipole: -27.57148 27.23016 -0.34132 -7.72930 7.92884 0.19954 -5.43756 4.46102 -0.97654
magnitude: 1.05354 au
magnitude: 2.67788 debye
