program: Orca
programVersion: 5.0.2
elementType: O O O C C C C C C C C C C C C C C C C C C C C C C C H H H H H H H H H H H H H H H H H H H H H H H H H H
charge: 0
multiplicity: 1
keywords: wb97x-d3
keywords: def2-TZVPP
keywords: def2/J RIJCOSX
keywords: DEFGRID2
keywords: scfconv7
keywords: smallprint printgap noloewdin
keywords: NOSOSCF
formula: C23H26O3
InChI: InChI=1/C23H26O3/c1-16(2)13-20-21(23(20,3)4)22(24)25-15-17-9-8-12-19(14-17)26-18-10-6-5-7-11-18/h5-14,20-21H,15H2,1-4H3
52 atoms
O  0.150181 -2.198607 -0.106642
O  -0.591164 -0.835327 -1.723974
O  3.353835 1.637288 1.041797
C  -2.347845 0.180492 0.716615
C  -3.183675 -0.577925 -0.256987
C  -1.896546 -1.197785 0.250781
C  -2.768517 0.25462 2.164128
C  -1.622536 1.417509 0.244389
C  -4.4911 -1.184664 0.103558
C  -0.744381 -1.366009 -0.649571
C  -5.066651 -2.193863 -0.555771
C  -6.405031 -2.731041 -0.151597
C  -4.441631 -2.863464 -1.740412
C  1.354138 -2.492202 -0.805315
C  2.513778 -1.663748 -0.321038
C  2.347354 -0.365151 0.14705
C  3.790692 -2.214233 -0.378218
C  3.458549 0.37634 0.528988
C  4.890268 -1.466515 0.013933
C  4.734607 -0.164903 0.46353
C  2.397442 2.507179 0.594176
C  2.086251 2.643158 -0.753807
C  1.789113 3.314339 1.545737
C  1.151706 3.593223 -1.139957
C  0.866049 4.268924 1.143019
C  0.539401 4.409968 -0.198431
H  -3.112789 -0.214962 -1.279351
H  -1.998503 -1.979639 0.995102
H  -3.474791 1.071991 2.324318
H  -1.901203 0.440833 2.800845
H  -3.238041 -0.664761 2.514419
H  -0.68364 1.555048 0.785201
H  -2.239662 2.298092 0.43403
H  -1.400953 1.402562 -0.820452
H  -5.017927 -0.754939 0.950997
H  -6.339803 -3.792419 0.103208
H  -7.124724 -2.656149 -0.971277
H  -6.818976 -2.203773 0.70802
H  -5.037003 -2.690267 -2.641384
H  -4.40922 -3.946977 -1.599636
H  -3.427189 -2.5233 -1.943658
H  1.221763 -2.364248 -1.881817
H  1.553706 -3.548616 -0.625423
H  1.363723 0.080424 0.223505
H  3.925001 -3.231579 -0.725581
H  5.880644 -1.901036 -0.028787
H  5.589722 0.423239 0.771824
H  2.56695 2.0228 -1.500004
H  2.044916 3.1993 2.591763
H  0.908355 3.698745 -2.189392
H  0.397528 4.900806 1.886616
H  -0.184001 5.152298 -0.508958
elementType: O C H
totalener: -1117.86889039 hartree
nucrepener: 2291.56998015 hartree
electener: -3409.43887054 hartree
oneelecener: -6072.79301056 hartree
twoeener: 2663.35414002 hartree
cpcmener: -0.02403486 hartree
kineticenergy: 1112.79165991 hartree
xcener: -110.227562351138 hartree
chargesum: 0.0000000
charge: -0.284040 -0.463498 -0.326941 0.198340 -0.047777 -0.094084 -0.300211 -0.301149 -0.280030 0.364840 -0.014892 -0.227108 -0.244416 0.083168 0.021820 -0.199625 -0.224920 0.272345 -0.109690 -0.255287 0.275795 -0.189432 -0.224810 -0.150729 -0.135007 -0.174104 0.104750 0.089281 0.100428 0.099592 0.092586 0.073126 0.107768 0.101100 0.123092 0.094367 0.094376 0.088398 0.101158 0.094127 0.079130 0.110762 0.117298 0.152654 0.138963 0.156297 0.144662 0.154823 0.143521 0.157863 0.155894 0.155427
qa: -0.2840 -0.4635 -0.3269 0.1983 -0.0478 -0.0941 -0.3002 -0.3011 -0.2800 0.3648 -0.0149 -0.2271 -0.2444 0.0832 0.0218 -0.1996 -0.2249 0.2723 -0.1097 -0.2553 0.2758 -0.1894 -0.2248 -0.1507 -0.1350 -0.1741 0.1047 0.0893 0.1004 0.0996 0.0926 0.0731 0.1078 0.1011 0.1231 0.0944 0.0944 0.0884 0.1012 0.0941 0.0791 0.1108 0.1173 0.1527 0.1390 0.1563 0.1447 0.1548 0.1435 0.1579 0.1559 0.1554
va: 2.1149 2.0326 2.0837 3.7008 3.8532 3.8181 3.9102 3.8753 3.8831 4.2044 3.7100 3.9284 3.9420 3.8446 3.6936 3.9445 3.9576 3.7618 3.8968 4.0030 3.6922 3.8898 3.9659 3.8487 3.8704 3.8553 1.0242 1.0346 0.9990 1.0015 1.0016 1.0050 1.0030 1.0125 1.0028 0.9968 0.9957 1.0068 0.9983 0.9992 1.0160 1.0135 0.9957 0.9698 1.0037 0.9893 1.0082 0.9971 1.0088 0.9913 0.9905 0.9918
dispcorr: -0.026969042 hartree
energy: -1117.895859428735
dipole: -29.19478 28.66190 -0.53288 -5.94710 5.31690 -0.63020 0.38501 -0.02117 0.36384
magnitude: 0.90193 au
magnitude: 2.29254 debye
