program: Orca
programVersion: 5.0.2
elementType: O O O C C C C C C C C C C C C C C C C C C C C C C C H H H H H H H H H H H H H H H H H H H H H H H H H H
charge: 0
multiplicity: 1
keywords: wb97x-d3
keywords: def2-TZVPP
keywords: def2/J RIJCOSX
keywords: DEFGRID2
keywords: scfconv7
keywords: smallprint printgap noloewdin
keywords: NOSOSCF
formula: C23H26O3
InChI: InChI=1/C23H26O3/c1-16(2)13-20-21(23(20,3)4)22(24)25-15-17-9-8-12-19(14-17)26-18-10-6-5-7-11-18/h5-14,20-21H,15H2,1-4H3
52 atoms
O  0.108004 -2.174402 0.322427
O  -0.564869 -1.206412 -1.582617
O  3.288974 1.798064 0.774461
C  -2.361886 0.369199 0.502931
C  -3.179071 -0.579968 -0.304658
C  -1.929057 -1.088044 0.381699
C  -2.851655 0.778817 1.870997
C  -1.583698 1.456594 -0.194811
C  -4.515547 -1.047211 0.148838
C  -0.755323 -1.475431 -0.420068
C  -4.99564 -2.283018 -0.011596
C  -6.359551 -2.659245 0.481741
C  -4.229653 -3.387475 -0.673238
C  1.328979 -2.620456 -0.258413
C  2.481913 -1.70508 0.055292
C  2.306065 -0.344038 0.271445
C  3.763957 -2.247337 0.103468
C  3.4119 0.462829 0.512727
C  4.857043 -1.433036 0.353774
C  4.691173 -0.071221 0.556756
C  2.365335 2.562549 0.116824
C  1.744844 3.564123 0.851402
C  2.090673 2.406147 -1.2369
C  0.849772 4.419353 0.224977
C  1.184648 3.262105 -1.846623
C  0.56245 4.271865 -1.124698
H  -3.067621 -0.464365 -1.380511
H  -2.073684 -1.677612 1.280348
H  -3.379141 -0.022486 2.388543
H  -3.531916 1.629916 1.797026
H  -2.014555 1.08375 2.501911
H  -2.183452 2.367883 -0.234805
H  -1.312864 1.203543 -1.217147
H  -0.667847 1.694825 0.350091
H  -5.149576 -0.308385 0.632113
H  -6.995809 -3.003001 -0.338076
H  -6.864982 -1.827724 0.973537
H  -6.302905 -3.486774 1.194449
H  -3.98148 -4.17233 0.04755
H  -3.30171 -3.053917 -1.135176
H  -4.834376 -3.864587 -1.448518
H  1.225516 -2.743372 -1.338424
H  1.516364 -3.607547 0.16328
H  1.320329 0.104013 0.26357
H  3.907042 -3.310635 -0.047357
H  5.849749 -1.862044 0.402153
H  5.541768 0.568647 0.755411
H  1.967276 3.675593 1.905509
H  2.57594 1.632565 -1.818656
H  0.373413 5.202249 0.801066
H  0.971499 3.138384 -2.90047
H  -0.138749 4.937529 -1.610576
elementType: O C H
totalener: -1117.86874678 hartree
nucrepener: 2299.13377501 hartree
electener: -3417.00252179 hartree
oneelecener: -6087.88896638 hartree
twoeener: 2670.88644459 hartree
cpcmener: -0.02395555 hartree
kineticenergy: 1112.78985385 hartree
xcener: -110.227804434713 hartree
chargesum: -0.0000000
charge: -0.285077 -0.463528 -0.327374 0.192380 -0.014884 -0.121131 -0.294460 -0.307620 -0.299073 0.370856 -0.012529 -0.228071 -0.241517 0.079994 0.023454 -0.199643 -0.223611 0.265455 -0.112209 -0.251150 0.274788 -0.224099 -0.186787 -0.133082 -0.152487 -0.178170 0.104609 0.093538 0.094560 0.099245 0.099634 0.106932 0.099972 0.074040 0.120932 0.095969 0.088399 0.093755 0.099987 0.081810 0.099992 0.111674 0.119453 0.157691 0.139101 0.156268 0.144731 0.143344 0.153924 0.155814 0.157934 0.156266
qa: -0.2851 -0.4635 -0.3274 0.1924 -0.0149 -0.1211 -0.2945 -0.3076 -0.2991 0.3709 -0.0125 -0.2281 -0.2415 0.0800 0.0235 -0.1996 -0.2236 0.2655 -0.1122 -0.2511 0.2748 -0.2241 -0.1868 -0.1331 -0.1525 -0.1782 0.1046 0.0935 0.0946 0.0992 0.0996 0.1069 0.1000 0.0740 0.1209 0.0960 0.0884 0.0938 0.1000 0.0818 0.1000 0.1117 0.1195 0.1577 0.1391 0.1563 0.1447 0.1433 0.1539 0.1558 0.1579 0.1563
va: 2.1147 2.0340 2.0841 3.6902 3.8240 3.8340 3.9049 3.8826 3.8926 4.1963 3.7069 3.9315 3.9348 3.8461 3.6846 3.9403 3.9590 3.7655 3.8954 4.0037 3.6972 3.9614 3.8807 3.8722 3.8439 3.8560 1.0265 1.0310 1.0021 0.9999 1.0019 1.0029 1.0130 1.0038 1.0034 0.9965 1.0065 0.9964 0.9980 1.0139 1.0004 1.0139 0.9948 0.9683 1.0032 0.9894 1.0077 1.0089 0.9978 0.9904 0.9916 0.9918
dispcorr: -0.027422543 hartree
energy: -1117.896169327191
dipole: -28.69320 28.17852 -0.51467 -5.79661 5.21937 -0.57724 1.95598 -1.41514 0.54084
magnitude: 0.94372 au
magnitude: 2.39875 debye
