program: Gaussian 09
title: 000071851
version: EM64L-G09RevD.01
frameworkgroup: C1[X(C17H31NO)]
method: RPBEPBE
basis: SDD
operation: Freq
keyword: #p
keyword: freq=noraman
keyword: PBEPBE/SDD
title: #p freq=noraman PBEPBE/SDD
converged: YES YES NO NO
title: Mulliken charges:
elementType: O N C C C C C C C C C C C C C C C C C H H H H H H H H H H H H H H H H H H H H H H H H H H H H H H H
charge: -0.274903 -0.111238 0.361144 -0.221211 -0.418663 -0.547729 -0.438375 0.621879 -0.772378 -0.773471 -0.474716 -0.636933 -0.233177 -0.243937 -0.393312 -0.323062 -0.327276 -0.673641 -0.673195 0.235601 0.227347 0.217137 0.237810 0.205847 0.210883 0.264195 0.201079 0.194920 0.225109 0.208869 0.212590 0.220805 0.228341 0.196639 0.190486 0.190841 0.195032 0.188111 0.222062 0.211021 0.202773 0.187778 0.207157 0.188139 0.213824 0.225252 0.205055 0.205942 0.225577 0.207968
chargesum: 0.00000
title: Mulliken charges with hydrogens summed into heavy atoms:
elementType: O N C C C C C C C C C C C C C C C C C
charge: -0.274903 -0.111238 0.361144 0.014390 -0.191316 -0.092783 -0.021644 0.621879 -0.112184 -0.126903 -0.253911 -0.211953 0.148151 0.139206 0.039771 0.067489 0.068020 -0.029509 -0.033707
polarizability: 2.12983054e+02 2.81412895e+00 1.85814558e+02 4.86066608e+00 2.46346674e+00 1.70987318e+02
1716.lowfreq: -13.0322 -8.9921 -0.0008 -0.0006 -0.0003 6.0504 7.9743 19.6594 27.7191
frequency: -10.3490 18.8926 26.5922 43.2893 62.6971 81.9576 92.4523 108.4148 118.0760 133.2286 165.7947 174.3829 194.3884 205.2851 216.5131 220.8997 249.0089 262.1077 282.5505 295.5874 307.9754 324.6135 348.5642 379.4477 384.5901 395.1249 424.3359 442.9639 458.1198 475.8993 487.5005 511.8507 594.8947 616.7851 676.4537 740.6100 760.3048 790.1233 795.8085 797.6317 805.0964 807.4183 841.1632 848.1318 883.9159 905.8649 915.2938 938.9778 941.7987 949.1908 960.7775 966.5170 984.4254 991.2509 1002.3364 1033.1390 1048.5928 1060.0971 1064.3183 1066.8535 1072.0003 1075.4058 1083.6232 1084.3943 1089.9332 1097.0596 1122.5887 1126.0964 1158.0469 1164.9219 1186.7095 1187.8859 1204.1827 1206.5505 1219.3846 1227.7898 1230.1249 1232.4925 1248.8710 1261.8021 1276.7009 1284.7054 1288.8269 1298.9094 1317.3116 1327.7809 1331.8175 1342.7343 1359.2709 1362.4550 1370.8815 1375.7554 1386.3811 1387.7573 1391.8321 1402.7569 1442.4749 1450.4900 1460.4297 1460.6538 1463.4955 1468.5601 1469.7516 1471.4968 1475.6283 1478.8047 1483.0223 1486.2116 1488.4194 1490.3837 1491.6255 1492.6850 1674.6986 2849.4919 2858.6082 2907.5674 2909.5759 2923.5255 2951.3587 2952.5915 2962.9768 2965.3027 2969.3152 2979.0796 2980.3939 2982.8656 2991.1786 3016.5581 3020.2533 3022.5959 3031.3623 3034.6708 3040.4120 3042.9224 3052.5651 3056.1331 3072.9862 3075.4442 3078.8307 3090.0290 3090.6026 3096.4832 3097.2678 3115.2245
redmass: 3.4041 3.7776 3.2542 3.5507 2.7573 2.5511 2.0845 2.9296 2.9501 3.1768 1.5268 1.2533 1.7715 1.5077 1.1307 1.8082 2.7818 2.1195 1.8377 2.2110 2.1395 2.1605 2.7912 2.4366 2.2527 2.8733 2.3300 2.6680 2.9701 3.5009 2.6724 3.2009 3.2978 4.1195 2.8563 2.7881 2.6564 1.3390 1.1808 1.1548 1.5428 1.4845 2.3993 2.6321 2.3867 2.1787 1.8809 1.8045 1.7545 1.7159 2.0154 1.8125 2.5331 2.5627 1.4363 2.4427 2.2265 2.3466 1.7181 2.8581 1.2092 1.9255 2.1804 2.1280 1.4242 2.3613 1.5615 1.6021 1.4244 1.4879 1.8274 1.2297 1.7999 2.2513 1.7994 1.6682 1.5545 1.6696 1.4619 2.1841 1.1141 1.2028 1.2399 1.7649 1.3058 1.5934 1.5706 1.8130 1.3561 1.3470 1.3640 1.2145 1.2367 1.2357 1.2035 1.4419 1.1014 1.0837 1.0579 1.0564 1.0542 1.0612 1.0652 1.0564 1.0733 1.0596 1.0667 1.0681 1.0723 1.0626 1.0776 1.0695 6.9769 1.0719 1.0714 1.0557 1.0690 1.0573 1.0596 1.0937 1.0383 1.0762 1.0371 1.1006 1.0371 1.0359 1.0999 1.0718 1.0872 1.0874 1.0874 1.0781 1.0981 1.0957 1.0979 1.0923 1.0983 1.0981 1.0978 1.1003 1.1003 1.0992 1.1028 1.0927
irintensity: 0.0175 0.0980 0.0617 0.1313 0.6174 0.6352 0.0741 0.8426 2.5577 9.1744 0.6380 0.2611 0.5018 0.2272 0.0504 0.2003 0.1042 0.4077 0.3445 2.7384 3.3111 1.6710 0.3961 0.1843 1.3733 4.8337 3.3724 5.2347 0.6895 1.0222 4.0001 0.7992 1.7915 2.3851 2.0293 9.3633 3.6033 4.2544 17.7026 5.5906 7.7009 1.9727 4.1078 0.6989 5.3355 1.9588 0.5004 0.6187 1.7027 2.4084 8.1288 2.1349 25.8413 5.5338 1.2813 52.4396 1.8305 2.7654 39.9104 118.7847 8.0447 17.0219 18.5132 3.3290 3.1828 13.4316 11.8886 0.9418 5.2990 3.8100 5.8792 3.7618 8.5677 27.8733 4.5351 2.9448 2.1687 22.0873 0.4830 6.9899 0.8169 17.2778 24.4006 3.8754 8.4891 4.5528 0.4692 6.0159 1.8178 0.9571 8.8780 20.3520 18.9369 22.9770 18.2325 0.4472 13.6242 12.1565 2.2953 1.9089 8.1198 5.6775 7.1991 4.2838 3.1380 6.8216 2.9606 10.0061 11.4975 22.7623 12.8280 7.6192 1.5038 34.2862 170.0655 48.4518 41.6102 111.1671 53.2580 37.6666 31.9644 100.7426 51.0791 37.7678 42.3307 32.0989 32.7758 18.6633 95.2334 16.0487 20.2394 42.7787 18.5609 33.1426 61.8818 34.0083 57.3030 72.8504 41.1516 28.8636 54.5309 1.7121 58.4025 21.7678
temp: 298.150 k
press: 1.00000 atm
elementType: 8 7 6 6 6 6 6 6 6 6 6 6 6 6 6 6 6 6 6 1 1 1 1 1 1 1 1 1 1 1 1 1 1 1 1 1 1 1 1 1 1 1 1 1 1 1 1 1 1 1
symmnumber: 1
zpe: 1171943.3 jmol-1
zpe.correction: 0.446370 hartree
zpe.thermalcorrener: 0.467562 hartree
zpe.thermalcorrenthalpy: 0.468506 hartree
zpe.thermalcorrgfe: 0.395707 hartree
zpe.sumelectzpe: -794.758930 hartree
zpe.sumelectthermal: -794.737737 hartree
zpe.sumelectthermalent: -794.736793 hartree
zpe.sumelectthermalfe: -794.809592 hartree
dipole: -0.7105 -0.0638 -0.5319
dipole: 0.8898
quadrupole: -115.2385 -116.6705 -118.2065
quadrupole: 1.3508 -2.6197 3.4707
quadrupole: 1.4667 0.0347 -1.5014 1.3508 -2.6197 3.4707
hfenergy: -795.2052997 hartree
pointgroup: C01 [X(C17H31N1O1)]
dipole: 0.284726 -0.0373129 0.2002526 debye
polarizability: 213.0010696|-3.8887105|186.104159|3.4450746|-2.341685|170.679701 unknown
InChI: InChI=1S/C17H31NO/c1-5-18(6-2)10-12-19-11-9-14-7-8-15-13-16(14)17(15,3)4/h7,15-16H,5-6,8-13H2,1-4H3
charge 0 multiplicity 1
50 atoms
O  0.633222 -1.436541 -0.08161
N  4.040264 0.105435 -0.231553
C  -2.674611 1.281279 0.568945
C  -3.917505 1.107303 -0.411152
C  -2.953469 -0.247373 0.949731
C  -4.464085 0.021698 0.585751
C  -3.49152 0.405522 -1.727904
C  -2.394694 -1.176759 -0.131385
C  -1.310775 1.669154 -0.028632
C  -2.99205 2.241385 1.738507
C  -2.691163 -0.856397 -1.421662
C  -1.578908 -2.389129 0.270372
C  -0.232561 -2.042762 0.933343
C  1.918994 -0.991775 0.467249
C  2.672917 -0.281067 -0.665609
C  4.480813 1.419444 -0.769027
C  5.031964 -0.98267 -0.446813
C  3.79164 2.609124 -0.073589
C  6.238611 -0.899662 0.507914
H  -4.535592 2.002921 -0.601901
H  -2.706852 -0.571057 1.976513
H  -5.04544 0.454697 1.415697
H  -5.016577 -0.82672 0.14964
H  -4.389958 0.157383 -2.331241
H  -2.883591 1.095408 -2.351272
H  -0.96074 0.947741 -0.784131
H  -1.369404 2.672941 -0.493715
H  -0.540439 1.7170 0.766574
H  -3.972203 2.046688 2.207139
H  -2.218936 2.158961 2.526669
H  -2.993938 3.290012 1.382701
H  -2.336734 -1.474824 -2.256502
H  -1.374202 -3.023513 -0.612276
H  -2.152271 -3.00573 0.995163
H  0.245057 -2.965446 1.334933
H  -0.376303 -1.336269 1.782217
H  1.764597 -0.289963 1.315299
H  2.49945 -1.8638 0.84448
H  2.100814 0.621046 -0.944722
H  2.683183 -0.942861 -1.563185
H  5.570863 1.502106 -0.605575
H  4.321022 1.484363 -1.87569
H  4.513888 -1.944942 -0.275219
H  5.389578 -1.0046 -1.508209
H  2.694679 2.585104 -0.209208
H  4.000654 2.587147 1.010191
H  4.159116 3.566582 -0.488395
H  6.925441 -1.749981 0.337743
H  5.893937 -0.924489 1.556446
H  6.817617 0.030286 0.362763
