program: Orca
programVersion: 5.0.2
elementType: O O O C C C C C C C C C C C C C C C C C C C C C C C H H H H H H H H H H H H H H H H H H H H H H H H H H
charge: 0
multiplicity: 1
keywords: wb97x-d3
keywords: def2-TZVPP
keywords: def2/J RIJCOSX
keywords: DEFGRID2
keywords: scfconv7
keywords: smallprint printgap noloewdin
keywords: NOSOSCF
formula: C23H26O3
InChI: InChI=1/C23H26O3/c1-16(2)13-20-21(23(20,3)4)22(24)25-15-17-9-8-12-19(14-17)26-18-10-6-5-7-11-18/h5-14,20-21H,15H2,1-4H3
52 atoms
O  0.338973 -1.961796 -1.533797
O  0.122709 -3.034482 0.413617
O  2.004744 2.089949 1.134188
C  -2.949659 -2.998925 -0.310504
C  -2.632899 -1.874934 0.60911
C  -1.795942 -2.064994 -0.647875
C  -4.143043 -2.881161 -1.227895
C  -2.690363 -4.414043 0.1428
C  -3.48564 -0.667241 0.7464
C  -0.379228 -2.427024 -0.505965
C  -3.022015 0.548672 1.047529
C  -3.938547 1.72394 1.191408
C  -1.568097 0.849128 1.244669
C  1.757083 -2.101139 -1.460371
C  2.367804 -1.232659 -0.39423
C  1.876882 0.048561 -0.161218
C  3.451967 -1.701112 0.338706
C  2.47919 0.848065 0.801191
C  4.047416 -0.889832 1.293703
C  3.567296 0.38821 1.530615
C  1.501091 2.943055 0.186868
C  1.995306 3.010465 -1.110123
C  0.491243 3.800689 0.604313
C  1.44943 3.930605 -1.994611
C  -0.036989 4.721212 -0.288212
C  0.432778 4.786197 -1.593066
H  -2.112013 -2.175286 1.515363
H  -1.998431 -1.373426 -1.457338
H  -4.292748 -1.865761 -1.594881
H  -5.055024 -3.18836 -0.711987
H  -4.019824 -3.531326 -2.095691
H  -2.434414 -5.055949 -0.702311
H  -3.595202 -4.818736 0.599847
H  -1.893836 -4.48931 0.879277
H  -4.555733 -0.798993 0.613673
H  -4.979302 1.458993 1.006686
H  -3.660974 2.519328 0.494868
H  -3.8704 2.154716 2.193412
H  -1.406262 1.370302 2.191205
H  -1.212188 1.521183 0.459383
H  -0.936467 -0.03727 1.239239
H  2.112826 -1.796018 -2.4449
H  2.040128 -3.146168 -1.31769
H  1.021283 0.4140 -0.71601
H  3.824513 -2.703549 0.169884
H  4.88911 -1.257153 1.86567
H  4.024147 1.022992 2.278847
H  2.794215 2.358248 -1.438128
H  0.121059 3.742575 1.619767
H  1.828379 3.975045 -3.007131
H  -0.82521 5.385722 0.040403
H  0.012223 5.49833 -2.290012
elementType: O C H
totalener: -1117.85502845 hartree
nucrepener: 2321.23722227 hartree
electener: -3439.09225072 hartree
oneelecener: -6132.29220130 hartree
twoeener: 2693.19995058 hartree
cpcmener: -0.03012521 hartree
kineticenergy: 1112.80549968 hartree
xcener: -110.231183251483 hartree
chargesum: 0.0000000
charge: -0.299130 -0.499003 -0.344507 0.163937 -0.015376 -0.084570 -0.288622 -0.279920 -0.305571 0.385368 0.014637 -0.231821 -0.269932 0.107121 0.031622 -0.292696 -0.233002 0.353521 -0.106154 -0.280073 0.334220 -0.217675 -0.298799 -0.142024 -0.105178 -0.198686 0.102433 0.091185 0.093528 0.100081 0.097970 0.100165 0.095272 0.090659 0.124869 0.091362 0.093047 0.096571 0.106393 0.099772 0.083649 0.122252 0.115708 0.147312 0.144587 0.161363 0.148602 0.158293 0.152227 0.162827 0.161047 0.161138
qa: -0.2991 -0.4990 -0.3445 0.1639 -0.0154 -0.0846 -0.2886 -0.2799 -0.3056 0.3854 0.0146 -0.2318 -0.2699 0.1071 0.0316 -0.2927 -0.2330 0.3535 -0.1062 -0.2801 0.3342 -0.2177 -0.2988 -0.1420 -0.1052 -0.1987 0.1024 0.0912 0.0935 0.1001 0.0980 0.1002 0.0953 0.0907 0.1249 0.0914 0.0930 0.0966 0.1064 0.0998 0.0836 0.1223 0.1157 0.1473 0.1446 0.1614 0.1486 0.1583 0.1522 0.1628 0.1610 0.1611
va: 2.1052 1.9952 2.0459 3.6971 3.8099 3.7879 3.9103 3.8872 3.9022 4.1355 3.6923 3.9279 3.9520 3.7892 3.6563 3.9386 3.9771 3.5944 3.8750 4.0417 3.6082 3.9097 3.9706 3.8827 3.8561 3.9129 1.0257 1.0341 1.0012 0.9994 1.0028 0.9989 1.0008 1.0190 1.0028 1.0062 0.9972 0.9965 1.0001 0.9957 1.0128 0.9922 1.0095 1.0088 1.0022 0.9875 1.0067 0.9970 1.0049 0.9887 0.9880 0.9894
dispcorr: -0.027577790 hartree
energy: -1117.882606240114
dipole: -22.67485 22.26373 -0.41112 -4.61996 5.20038 0.58042 -0.57980 -0.66769 -1.24748
magnitude: 1.43601 au
magnitude: 3.65004 debye
