program: Orca
programVersion: 5.0.2
elementType: O O O C C C C C C C C C C C C C C C C C C C C C C C H H H H H H H H H H H H H H H H H H H H H H H H H H
charge: 0
multiplicity: 1
keywords: wb97x-d3
keywords: def2-TZVPP
keywords: def2/J RIJCOSX
keywords: DEFGRID2
keywords: scfconv7
keywords: smallprint printgap noloewdin
keywords: NOSOSCF
formula: C23H26O3
InChI: InChI=1/C23H26O3/c1-16(2)13-20-21(23(20,3)4)22(24)25-15-17-9-8-12-19(14-17)26-18-10-6-5-7-11-18/h5-14,20-21H,15H2,1-4H3
52 atoms
O  0.473193 -2.85077 0.187906
O  -0.18099 -1.308614 1.673339
O  2.717386 2.212373 0.039473
C  -3.076985 -1.927255 0.698907
C  -2.515148 -0.847668 -0.155997
C  -1.724795 -2.14068 0.044982
C  -4.182434 -2.794126 0.14356
C  -3.199207 -1.702438 2.186125
C  -3.057732 -0.500936 -1.493304
C  -0.436005 -2.042889 0.744188
C  -2.343881 0.025101 -2.492992
C  -2.984841 0.402773 -3.792991
C  -0.872069 0.293059 -2.407722
C  1.862514 -2.605706 0.470789
C  2.305895 -1.413107 -0.326429
C  2.387978 -0.161567 0.269134
C  2.53095 -1.540174 -1.695411
C  2.642346 0.957886 -0.512089
C  2.825405 -0.421003 -2.457542
C  2.86389 0.838837 -1.874608
C  1.765115 2.60786 0.945876
C  0.440965 2.190564 0.871111
C  2.171629 3.497772 1.930549
C  -0.471969 2.6641 1.802478
C  1.24414 3.97146 2.847403
C  -0.078646 3.553827 2.793069
H  -2.098723 -0.009966 0.399852
H  -1.724819 -2.82242 -0.79729
H  -5.153387 -2.314134 0.279929
H  -4.212572 -3.751813 0.666054
H  -4.059477 -3.003131 -0.919153
H  -3.050456 -2.631975 2.738599
H  -4.204841 -1.344144 2.414231
H  -2.49856 -0.964696 2.568822
H  -4.1220 -0.657592 -1.646097
H  -2.533094 -0.142892 -4.62509
H  -2.838873 1.464803 -4.006142
H  -4.055898 0.202117 -3.797792
H  -0.674588 1.368124 -2.411287
H  -0.356088 -0.115469 -3.279338
H  -0.407296 -0.126528 -1.517145
H  2.375309 -3.510779 0.150747
H  2.034591 -2.475557 1.539283
H  2.236467 -0.059436 1.336164
H  2.475283 -2.51505 -2.163797
H  3.007396 -0.521936 -3.519226
H  3.068571 1.71896 -2.470625
H  0.112659 1.508033 0.097724
H  3.20501 3.81733 1.976535
H  -1.501356 2.334361 1.743384
H  1.563859 4.665093 3.613961
H  -0.79682 3.919449 3.514619
elementType: O C H
totalener: -1117.85339648 hartree
nucrepener: 2371.69578802 hartree
electener: -3489.54918449 hartree
oneelecener: -6233.34613218 hartree
twoeener: 2743.79694769 hartree
cpcmener: -0.02893739 hartree
kineticenergy: 1112.80709710 hartree
xcener: -110.229273496757 hartree
chargesum: 0.0000000
charge: -0.293389 -0.497374 -0.343563 0.187203 -0.037957 -0.067168 -0.295369 -0.285069 -0.290014 0.375423 0.002251 -0.231958 -0.214522 0.083249 -0.004332 -0.169078 -0.212622 0.275909 -0.141527 -0.238855 0.255870 -0.139778 -0.224952 -0.206047 -0.145301 -0.162764 0.091583 0.091851 0.099952 0.098724 0.093671 0.100827 0.094416 0.088918 0.125197 0.096703 0.095927 0.090261 0.108501 0.105286 0.015166 0.125816 0.115139 0.143110 0.144492 0.160885 0.147405 0.155142 0.147591 0.163848 0.160385 0.160936
qa: -0.2934 -0.4974 -0.3436 0.1872 -0.0380 -0.0672 -0.2954 -0.2851 -0.2900 0.3754 0.0023 -0.2320 -0.2145 0.0832 -0.0043 -0.1691 -0.2126 0.2759 -0.1415 -0.2389 0.2559 -0.1398 -0.2250 -0.2060 -0.1453 -0.1628 0.0916 0.0919 0.1000 0.0987 0.0937 0.1008 0.0944 0.0889 0.1252 0.0967 0.0959 0.0903 0.1085 0.1053 0.0152 0.1258 0.1151 0.1431 0.1445 0.1609 0.1474 0.1551 0.1476 0.1638 0.1604 0.1609
va: 2.1047 1.9897 2.0701 3.6812 3.8357 3.8019 3.9151 3.8832 3.8615 4.1451 3.7519 3.9301 3.9251 3.8127 3.6119 3.8847 3.9224 3.6958 3.8539 3.9734 3.7220 3.8236 3.9680 3.9298 3.9044 3.8782 1.0223 1.0334 0.9993 1.0026 1.0008 0.9989 1.0009 1.0190 1.0037 0.9967 0.9953 1.0062 0.9962 1.0020 1.0220 0.9950 1.0116 1.0190 1.0031 0.9886 1.0059 0.9660 1.0076 0.9900 0.9879 0.9896
dispcorr: -0.029889555 hartree
energy: -1117.883286033506
dipole: -22.73063 22.18115 -0.54947 -5.47093 4.80489 -0.66604 -7.91004 6.85140 -1.05864
magnitude: 1.36610 au
magnitude: 3.47236 debye
