program: Orca
programVersion: 5.0.2
elementType: O O O C C C C C C C C C C C C C C C C C C C C C C C H H H H H H H H H H H H H H H H H H H H H H H H H H
charge: 0
multiplicity: 1
keywords: wb97x-d3
keywords: def2-TZVPP
keywords: def2/J RIJCOSX
keywords: DEFGRID2
keywords: scfconv7
keywords: smallprint printgap noloewdin
keywords: NOSOSCF
formula: C23H26O3
InChI: InChI=1/C23H26O3/c1-16(2)13-20-21(23(20,3)4)22(24)25-15-17-9-8-12-19(14-17)26-18-10-6-5-7-11-18/h5-14,20-21H,15H2,1-4H3
52 atoms
O  0.672206 -2.742846 0.190477
O  -0.102648 -1.095416 1.495538
O  2.998047 2.23749 -0.169619
C  -2.895663 -2.293628 0.676316
C  -2.591974 -1.073403 -0.134774
C  -1.563835 -2.19375 -0.046406
C  -3.851887 -3.332218 0.139474
C  -2.96547 -2.158402 2.177727
C  -3.212896 -0.784588 -1.440922
C  -0.288589 -1.935158 0.642482
C  -3.563401 0.421313 -1.901152
C  -4.140177 0.577529 -3.275986
C  -3.403416 1.70517 -1.143614
C  2.029537 -2.51115 0.612209
C  2.629259 -1.412014 -0.215553
C  2.611872 -0.103191 0.24911
C  3.129615 -1.684988 -1.485722
C  3.032672 0.928975 -0.577713
C  3.594672 -0.650412 -2.283707
C  3.532511 0.664304 -1.84382
C  1.954983 2.659056 0.621228
C  2.258344 3.51447 1.669503
C  0.640008 2.285964 0.365201
C  1.234695 3.999384 2.472588
C  -0.369812 2.764995 1.18648
C  -0.080181 3.621236 2.241253
H  -2.335207 -0.204865 0.462124
H  -1.4790 -2.826747 -0.922459
H  -3.740768 -3.502436 -0.930387
H  -4.884484 -3.030308 0.324348
H  -3.692643 -4.288283 0.640996
H  -2.373597 -1.332359 2.564516
H  -2.631348 -3.074524 2.668472
H  -4.000175 -1.984951 2.479057
H  -3.369404 -1.637197 -2.094948
H  -4.189246 -0.368808 -3.813831
H  -3.543171 1.273248 -3.87151
H  -5.148491 0.997127 -3.23419
H  -2.57165 2.289209 -1.544639
H  -3.228751 1.567827 -0.079244
H  -4.294479 2.325969 -1.25138
H  2.538312 -3.457305 0.437142
H  2.075193 -2.291507 1.678921
H  2.25324 0.106845 1.247865
H  3.156418 -2.704453 -1.849842
H  3.992104 -0.862508 -3.267386
H  3.86876 1.475383 -2.476908
H  3.286304 3.798462 1.855421
H  0.397671 1.626829 -0.458959
H  1.473032 4.667716 3.289415
H  -1.39235 2.468098 0.992724
H  -0.874189 3.991443 2.875768
elementType: O C H
totalener: -1117.85515716 hartree
nucrepener: 2311.72657707 hartree
electener: -3429.58173422 hartree
oneelecener: -6113.62882544 hartree
twoeener: 2684.04709122 hartree
cpcmener: -0.03014279 hartree
kineticenergy: 1112.80946752 hartree
xcener: -110.229164523145 hartree
chargesum: 0.0000000
charge: -0.292017 -0.505151 -0.344396 0.089506 0.052465 -0.067880 -0.274025 -0.274962 -0.282490 0.410369 -0.036481 -0.219391 -0.285083 0.087891 -0.013720 -0.171013 -0.236851 0.269460 -0.115253 -0.252980 0.319699 -0.262506 -0.239681 -0.108561 -0.114724 -0.226691 0.080909 0.089228 0.089909 0.098211 0.097945 0.090349 0.099828 0.096543 0.121440 0.088326 0.093659 0.094129 0.103156 0.099815 0.100371 0.126215 0.115926 0.144985 0.146696 0.161929 0.150067 0.147761 0.158681 0.161058 0.177902 0.159428
qa: -0.2920 -0.5052 -0.3444 0.0895 0.0525 -0.0679 -0.2740 -0.2750 -0.2825 0.4104 -0.0365 -0.2194 -0.2851 0.0879 -0.0137 -0.1710 -0.2369 0.2695 -0.1153 -0.2530 0.3197 -0.2625 -0.2397 -0.1086 -0.1147 -0.2267 0.0809 0.0892 0.0899 0.0982 0.0979 0.0903 0.0998 0.0965 0.1214 0.0883 0.0937 0.0941 0.1032 0.0998 0.1004 0.1262 0.1159 0.1450 0.1467 0.1619 0.1501 0.1478 0.1587 0.1611 0.1779 0.1594
va: 2.1241 1.9839 2.0662 3.7210 3.7691 3.8081 3.9116 3.8987 3.8853 4.1438 3.7281 3.9237 3.9424 3.7961 3.6490 3.8627 3.9818 3.7287 3.8790 4.0229 3.6645 4.0177 3.8947 3.8653 3.8121 3.9692 1.0222 1.0354 1.0062 1.0011 1.0013 1.0196 0.9993 0.9997 1.0103 1.0090 0.9952 0.9963 0.9939 1.0028 1.0000 0.9949 1.0129 1.0219 1.0024 0.9870 1.0048 1.0074 0.9964 0.9873 0.9781 0.9928
dispcorr: -0.026205755 hartree
energy: -1117.881362909770
dipole: -28.66951 27.98696 -0.68255 -5.07879 4.26571 -0.81308 -4.29763 3.65950 -0.63812
magnitude: 1.23862 au
magnitude: 3.14832 debye
