program: Orca
programVersion: 5.0.2
elementType: O O O C C C C C C C C C C C C C C C C C C C C C C C H H H H H H H H H H H H H H H H H H H H H H H H H H
charge: 0
multiplicity: 1
keywords: wb97x-d3
keywords: def2-TZVPP
keywords: def2/J RIJCOSX
keywords: DEFGRID2
keywords: scfconv7
keywords: smallprint printgap noloewdin
keywords: NOSOSCF
formula: C23H26O3
InChI: InChI=1/C23H26O3/c1-16(2)13-20-21(23(20,3)4)22(24)25-15-17-9-8-12-19(14-17)26-18-10-6-5-7-11-18/h5-14,20-21H,15H2,1-4H3
52 atoms
O  0.702311 -2.313924 -1.239472
O  0.188617 -2.179042 0.932417
O  2.998523 2.063257 -0.150183
C  -2.732636 -2.31748 -0.290367
C  -2.42876 -0.928482 0.184881
C  -1.44918 -1.629478 -0.730723
C  -3.771084 -2.516675 -1.366914
C  -2.694514 -3.446133 0.708813
C  -3.157961 0.254671 -0.322939
C  -0.133108 -2.057832 -0.227734
C  -3.894822 1.095745 0.409166
C  -4.576047 2.271548 -0.222999
C  -4.101201 0.973785 1.887417
C  2.036252 -2.702329 -0.920988
C  2.840851 -1.593804 -0.300098
C  2.535769 -0.262049 -0.54558
C  3.927131 -1.911949 0.509423
C  3.286145 0.737029 0.059238
C  4.695934 -0.90326 1.069362
C  4.373217 0.430521 0.861928
C  1.691182 2.478723 -0.081995
C  1.308533 3.498714 -0.941108
C  0.789055 1.946849 0.833433
C  0.011746 3.990768 -0.882494
C  -0.505264 2.443881 0.874313
C  -0.903059 3.462522 0.01752
H  -2.112589 -0.876885 1.221821
H  -1.446315 -1.304523 -1.765643
H  -3.746361 -1.735039 -2.125071
H  -4.772512 -2.528043 -0.932077
H  -3.619571 -3.472196 -1.87214
H  -2.032958 -3.254766 1.550753
H  -2.381795 -4.379232 0.235858
H  -3.695587 -3.604899 1.114108
H  -3.084379 0.442047 -1.39043
H  -5.659692 2.216294 -0.089975
H  -4.370162 2.342441 -1.290819
H  -4.256974 3.206562 0.245248
H  -5.16723 0.901936 2.118086
H  -3.736814 1.866398 2.402902
H  -3.61095 0.108723 2.329352
H  2.471124 -2.996385 -1.876578
H  2.038699 -3.583821 -0.276303
H  1.70586 0.006601 -1.188141
H  4.166571 -2.949387 0.70805
H  5.539543 -1.155204 1.698179
H  4.951854 1.220576 1.322762
H  2.020383 3.904429 -1.64879
H  1.081716 1.153442 1.509494
H  -0.283719 4.785403 -1.554936
H  -1.205891 2.029106 1.58773
H  -1.915497 3.84267 0.054601
elementType: O C H
totalener: -1117.85689928 hartree
nucrepener: 2340.30183690 hartree
electener: -3458.15873618 hartree
oneelecener: -6170.65104896 hartree
twoeener: 2712.49231277 hartree
cpcmener: -0.03155812 hartree
kineticenergy: 1112.80012374 hartree
xcener: -110.231099101831 hartree
chargesum: -0.0000000
charge: -0.297410 -0.490716 -0.345942 0.129774 0.021180 -0.090348 -0.265338 -0.283737 -0.276115 0.396273 -0.057812 -0.244099 -0.264968 0.101653 0.026888 -0.219109 -0.229691 0.265721 -0.120209 -0.250116 0.298951 -0.251071 -0.191010 -0.128962 -0.169078 -0.197488 0.094119 0.091570 0.090056 0.097202 0.098560 0.090721 0.101809 0.097018 0.123838 0.106538 0.095624 0.091559 0.107293 0.094218 0.094710 0.125651 0.118968 0.147065 0.144750 0.161144 0.149207 0.147560 0.150492 0.159583 0.177708 0.175815
qa: -0.2974 -0.4907 -0.3459 0.1298 0.0212 -0.0903 -0.2653 -0.2837 -0.2761 0.3963 -0.0578 -0.2441 -0.2650 0.1017 0.0269 -0.2191 -0.2297 0.2657 -0.1202 -0.2501 0.2990 -0.2511 -0.1910 -0.1290 -0.1691 -0.1975 0.0941 0.0916 0.0901 0.0972 0.0986 0.0907 0.1018 0.0970 0.1238 0.1065 0.0956 0.0916 0.1073 0.0942 0.0947 0.1257 0.1190 0.1471 0.1447 0.1611 0.1492 0.1476 0.1505 0.1596 0.1777 0.1758
va: 2.1148 2.0006 2.0611 3.7440 3.7243 3.8508 3.9052 3.9041 3.8005 4.1338 3.7148 3.9160 3.9396 3.7856 3.6025 3.9205 3.9689 3.7169 3.8843 4.0173 3.6630 4.0079 3.8784 3.9135 3.8588 3.8761 1.0285 1.0384 1.0040 1.0025 1.0029 1.0182 0.9993 1.0005 1.0092 0.9987 1.0067 0.9943 0.9990 0.9958 1.0072 0.9917 1.0084 1.0151 1.0011 0.9875 1.0046 1.0072 1.0068 0.9892 0.9717 0.9789
dispcorr: -0.028209080 hartree
energy: -1117.885108364002
dipole: -30.64041 29.67227 -0.96814 -3.41188 2.99023 -0.42165 1.82846 -2.54355 -0.71509
magnitude: 1.27532 au
magnitude: 3.24160 debye
