program: Orca
programVersion: 5.0.2
elementType: O O O C C C C C C C C C C C C C C C C C C C C C C C H H H H H H H H H H H H H H H H H H H H H H H H H H
charge: 0
multiplicity: 1
keywords: wb97x-d3
keywords: def2-TZVPP
keywords: def2/J RIJCOSX
keywords: DEFGRID2
keywords: scfconv7
keywords: smallprint printgap noloewdin
keywords: NOSOSCF
formula: C23H26O3
InChI: InChI=1/C23H26O3/c1-16(2)13-20-21(23(20,3)4)22(24)25-15-17-9-8-12-19(14-17)26-18-10-6-5-7-11-18/h5-14,20-21H,15H2,1-4H3
52 atoms
O  0.410555 -2.392247 -1.140532
O  0.239429 -2.219084 1.080914
O  2.646845 2.086766 -0.256541
C  -2.838233 -2.269779 0.546953
C  -2.405974 -0.841839 0.594316
C  -1.670018 -1.808084 -0.311952
C  -4.083329 -2.622848 -0.23147
C  -2.626569 -3.148822 1.753628
C  -3.258874 0.244571 0.050477
C  -0.272098 -2.156426 -0.014304
C  -2.974463 1.09634 -0.938342
C  -3.96086 2.143873 -1.357724
C  -1.692497 1.113583 -1.711699
C  1.794006 -2.711294 -1.029181
C  2.644402 -1.565886 -0.549483
C  2.221936 -0.247604 -0.648123
C  3.903279 -1.843779 -0.023787
C  3.036179 0.772384 -0.174785
C  4.724945 -0.812417 0.401911
C  4.291324 0.504915 0.345973
C  1.415988 2.474498 0.20584
C  0.911423 3.658489 -0.317725
C  0.708728 1.775448 1.178306
C  -0.306519 4.144373 0.134582
C  -0.513372 2.271063 1.612679
C  -1.028839 3.452308 1.097466
H  -1.856675 -0.578563 1.497058
H  -1.892306 -1.733283 -1.369711
H  -4.972368 -2.502813 0.391009
H  -4.047834 -3.663835 -0.5579
H  -4.209804 -2.000182 -1.117035
H  -1.80233 -2.825257 2.383788
H  -2.44489 -4.184682 1.460651
H  -3.528294 -3.137906 2.368647
H  -4.220772 0.351991 0.546409
H  -4.188182 2.061632 -2.423553
H  -3.546885 3.144497 -1.206682
H  -4.897987 2.076503 -0.805937
H  -1.310812 2.134193 -1.785605
H  -1.85661 0.772405 -2.73768
H  -0.911517 0.497825 -1.274447
H  2.090173 -3.00231 -2.037673
H  1.936676 -3.581785 -0.384695
H  1.259403 -0.001447 -1.078923
H  4.239156 -2.870295 0.0566
H  5.703651 -1.034765 0.8058
H  4.917659 1.311704 0.703452
H  1.472022 4.195607 -1.072246
H  1.089726 0.854258 1.59953
H  -0.694024 5.066903 -0.277368
H  -1.063382 1.721727 2.365865
H  -1.982798 3.828686 1.441495
elementType: O C H
totalener: -1117.85502793 hartree
nucrepener: 2392.15697659 hartree
electener: -3510.01200452 hartree
oneelecener: -6274.25830625 hartree
twoeener: 2764.24630173 hartree
cpcmener: -0.02952595 hartree
kineticenergy: 1112.80104684 hartree
xcener: -110.235170622734 hartree
chargesum: -0.0000000
charge: -0.299667 -0.490231 -0.338633 0.125406 -0.013409 -0.029977 -0.279607 -0.287028 -0.301548 0.353053 -0.007339 -0.228062 -0.221777 0.068285 0.024840 -0.258193 -0.216795 0.265081 -0.121677 -0.248710 0.330851 -0.268805 -0.210262 -0.110372 -0.141950 -0.212792 0.092368 0.105629 0.098468 0.099943 0.090860 0.091660 0.100466 0.095026 0.116240 0.099767 0.092254 0.090042 0.102083 0.121294 0.031222 0.128887 0.119817 0.214519 0.144358 0.161277 0.148680 0.144680 0.148643 0.157751 0.164505 0.158877
qa: -0.2997 -0.4902 -0.3386 0.1254 -0.0134 -0.0300 -0.2796 -0.2870 -0.3015 0.3531 -0.0073 -0.2281 -0.2218 0.0683 0.0248 -0.2582 -0.2168 0.2651 -0.1217 -0.2487 0.3309 -0.2688 -0.2103 -0.1104 -0.1420 -0.2128 0.0924 0.1056 0.0985 0.0999 0.0909 0.0917 0.1005 0.0950 0.1162 0.0998 0.0923 0.0900 0.1021 0.1213 0.0312 0.1289 0.1198 0.2145 0.1444 0.1613 0.1487 0.1447 0.1486 0.1578 0.1645 0.1589
va: 2.1124 1.9978 2.0729 3.7865 3.7661 3.7738 3.8996 3.8871 3.8323 4.1375 3.7338 3.9218 3.8949 3.8076 3.6080 3.9378 3.9609 3.7238 3.8765 4.0185 3.6399 3.9771 3.8301 3.8472 3.8275 3.8589 1.0212 1.0265 1.0015 1.0024 1.0052 1.0208 0.9985 1.0004 1.0083 0.9973 0.9965 1.0067 1.0011 1.0037 1.0273 0.9903 1.0083 0.9540 1.0000 0.9875 1.0049 1.0100 1.0099 0.9891 0.9870 0.9914
dispcorr: -0.031341648 hartree
energy: -1117.886369576999
dipole: -25.16051 24.37934 -0.78117 -2.94508 2.54608 -0.39900 -2.34350 1.44230 -0.90120
magnitude: 1.25761 au
magnitude: 3.19659 debye
