program: Orca
programVersion: 5.0.2
elementType: O O O C C C C C C C C C C C C C C C C C C C C C C C H H H H H H H H H H H H H H H H H H H H H H H H H H
charge: 0
multiplicity: 1
keywords: wb97x-d3
keywords: def2-TZVPP
keywords: def2/J RIJCOSX
keywords: DEFGRID2
keywords: scfconv7
keywords: smallprint printgap noloewdin
keywords: NOSOSCF
formula: C23H26O3
InChI: InChI=1/C23H26O3/c1-16(2)13-20-21(23(20,3)4)22(24)25-15-17-9-8-12-19(14-17)26-18-10-6-5-7-11-18/h5-14,20-21H,15H2,1-4H3
52 atoms
O  0.15716 -2.031259 -1.715842
O  -0.571063 -0.029903 -1.033184
O  3.924725 1.720476 0.746814
C  -2.359768 -2.016829 0.702663
C  -3.187584 -1.256326 -0.291215
C  -1.949955 -1.970241 -0.76315
C  -2.859807 -3.348825 1.200953
C  -1.579029 -1.247115 1.738404
C  -4.516587 -1.742015 -0.741106
C  -0.750872 -1.218709 -1.17236
C  -5.687177 -1.324362 -0.252357
C  -6.986016 -1.854042 -0.777881
C  -5.811342 -0.312147 0.844223
C  1.439456 -1.479098 -2.036025
C  2.210877 -1.134723 -0.793245
C  2.706297 0.14934 -0.619193
C  2.420083 -2.096849 0.192435
C  3.392725 0.472064 0.54448
C  3.118498 -1.766024 1.34259
C  3.60113 -0.477726 1.531379
C  3.19095 2.840267 0.448043
C  1.806898 2.889682 0.568985
C  3.907931 3.966043 0.064346
C  1.146043 4.078204 0.291022
C  3.233496 5.149033 -0.199296
C  1.850588 5.211041 -0.093183
H  -3.085951 -0.177341 -0.215799
H  -2.100134 -2.900973 -1.300593
H  -3.373005 -3.919788 0.427931
H  -3.558337 -3.207633 2.028438
H  -2.031378 -3.957124 1.568715
H  -0.654272 -1.765681 2.001307
H  -2.17403 -1.156375 2.649163
H  -1.321096 -0.238572 1.420962
H  -4.523945 -2.494699 -1.524459
H  -7.566267 -2.327048 0.018441
H  -6.841678 -2.586143 -1.572139
H  -7.607687 -1.046003 -1.172201
H  -6.388664 -0.721898 1.676874
H  -6.3563 0.570526 0.499574
H  -4.851235 0.017781 1.237879
H  1.336055 -0.612381 -2.691188
H  1.940093 -2.265704 -2.599237
H  2.543416 0.894764 -1.388597
H  2.042976 -3.103569 0.062905
H  3.284035 -2.512666 2.107834
H  4.136564 -0.214467 2.434551
H  1.239684 2.019343 0.873865
H  4.985808 3.915093 -0.023492
H  0.068503 4.114542 0.38316
H  3.79607 6.024187 -0.496977
H  1.326936 6.133109 -0.306728
elementType: O C H
totalener: -1117.85539387 hartree
nucrepener: 2238.16095788 hartree
electener: -3356.01635175 hartree
oneelecener: -5966.45373602 hartree
twoeener: 2610.43738427 hartree
cpcmener: -0.02971945 hartree
kineticenergy: 1112.80597231 hartree
xcener: -110.227604032746 hartree
chargesum: 0.0000000
charge: -0.288655 -0.492689 -0.341697 0.147364 -0.013769 -0.116451 -0.275436 -0.292382 -0.266320 0.407599 -0.035006 -0.231816 -0.250827 0.094436 0.046442 -0.221685 -0.275998 0.291017 -0.105419 -0.250877 0.300894 -0.193201 -0.258014 -0.158174 -0.123532 -0.192528 0.098190 0.095392 0.092848 0.097434 0.100699 0.098286 0.100996 0.090004 0.123569 0.094601 0.090138 0.095347 0.096564 0.101075 0.087372 0.117678 0.127470 0.146513 0.143146 0.160867 0.149378 0.157500 0.147190 0.162120 0.161217 0.161132
qa: -0.2887 -0.4927 -0.3417 0.1474 -0.0138 -0.1165 -0.2754 -0.2924 -0.2663 0.4076 -0.0350 -0.2318 -0.2508 0.0944 0.0464 -0.2217 -0.2760 0.2910 -0.1054 -0.2509 0.3009 -0.1932 -0.2580 -0.1582 -0.1235 -0.1925 0.0982 0.0954 0.0928 0.0974 0.1007 0.0983 0.1010 0.0900 0.1236 0.0946 0.0901 0.0953 0.0966 0.1011 0.0874 0.1177 0.1275 0.1465 0.1431 0.1609 0.1494 0.1575 0.1472 0.1621 0.1612 0.1611
va: 2.1144 2.0076 2.0645 3.6663 3.8026 3.8463 3.9026 3.9020 3.8623 4.1953 3.7008 3.9269 3.9386 3.7904 3.5735 3.9360 3.9484 3.6877 3.8639 4.0218 3.6771 3.8851 3.9993 3.8997 3.8806 3.9019 1.0242 1.0361 1.0017 1.0016 1.0027 1.0011 1.0026 1.0140 1.0063 0.9963 1.0074 0.9951 0.9978 0.9980 1.0080 1.0090 0.9928 1.0070 1.0108 0.9876 1.0050 0.9969 1.0084 0.9901 0.9878 0.9894
dispcorr: -0.025171603 hartree
energy: -1117.880565472166
dipole: -33.48483 32.70505 -0.77978 -10.88713 9.78671 -1.10042 6.04900 -5.97741 0.07159
magnitude: 1.35060 au
magnitude: 3.43294 debye
