program: Orca
programVersion: 5.0.2
elementType: O O O C C C C C C C C C C C C C C C C C C C C C C C H H H H H H H H H H H H H H H H H H H H H H H H H H
charge: 0
multiplicity: 1
keywords: wb97x-d3
keywords: def2-TZVPP
keywords: def2/J RIJCOSX
keywords: DEFGRID2
keywords: scfconv7
keywords: smallprint printgap noloewdin
keywords: NOSOSCF
formula: C23H26O3
InChI: InChI=1/C23H26O3/c1-16(2)13-20-21(23(20,3)4)22(24)25-15-17-9-8-12-19(14-17)26-18-10-6-5-7-11-18/h5-14,20-21H,15H2,1-4H3
52 atoms
O  0.41314 -2.369949 -1.190875
O  0.262399 -2.243584 1.035024
O  2.647163 2.10177 -0.266169
C  -2.819699 -2.312992 0.525093
C  -2.399238 -0.882566 0.60724
C  -1.663627 -1.817902 -0.330515
C  -4.068068 -2.656203 -0.252184
C  -2.588023 -3.222863 1.705204
C  -3.266585 0.211057 0.102589
C  -0.260798 -2.163872 -0.053406
C  -3.005966 1.085428 -0.873024
C  -4.007228 2.135404 -1.24931
C  -1.739705 1.127591 -1.671025
C  1.799606 -2.68256 -1.098167
C  2.642849 -1.547679 -0.583397
C  2.228649 -0.226908 -0.686693
C  3.882903 -1.834588 -0.019848
C  3.032093 0.785903 -0.181786
C  4.695361 -0.809451 0.438073
C  4.269267 0.509959 0.376462
C  1.419656 2.491971 0.202705
C  0.7060 1.783106 1.163346
C  0.925847 3.68926 -0.300956
C  -0.510375 2.283708 1.608311
C  -0.286563 4.179206 0.16113
C  -1.014626 3.478431 1.113558
H  -1.845244 -0.639898 1.512857
H  -1.894809 -1.717854 -1.384248
H  -4.028668 -3.688981 -0.60313
H  -4.20455 -2.014396 -1.122277
H  -4.95342 -2.555997 0.378706
H  -1.770834 -2.899897 2.344518
H  -2.383883 -4.245408 1.382701
H  -3.488741 -3.249911 2.320844
H  -4.219039 0.30245 0.6196
H  -4.256447 2.074828 -2.311753
H  -3.597251 3.135589 -1.085226
H  -4.932439 2.049706 -0.680129
H  -0.946254 0.506425 -1.264698
H  -1.364722 2.15189 -1.728435
H  -1.922825 0.810012 -2.701344
H  2.091929 -2.93571 -2.117801
H  1.951494 -3.574083 -0.485501
H  1.278867 0.024822 -1.142686
H  4.210847 -2.863292 0.065235
H  5.659633 -1.038697 0.871781
H  4.887139 1.312177 0.758249
H  1.07861 0.851081 1.568188
H  1.492026 4.233907 -1.045917
H  -1.064266 1.727962 2.353952
H  -0.66538 5.112639 -0.234025
H  -1.963649 3.859161 1.466271
elementType: O C H
totalener: -1117.85510391 hartree
nucrepener: 2390.17602139 hartree
electener: -3508.03112530 hartree
oneelecener: -6270.30523167 hartree
twoeener: 2762.27410637 hartree
cpcmener: -0.02953403 hartree
kineticenergy: 1112.80251357 hartree
xcener: -110.234964197681 hartree
chargesum: -0.0000000
charge: -0.299795 -0.490598 -0.339121 0.122195 -0.011115 -0.031453 -0.279022 -0.286696 -0.304960 0.356326 -0.003365 -0.227973 -0.225588 0.072353 0.028815 -0.259376 -0.216444 0.264527 -0.121796 -0.246084 0.327399 -0.206088 -0.264981 -0.147546 -0.111842 -0.211085 0.092946 0.105485 0.099840 0.090596 0.098541 0.091502 0.100798 0.095128 0.116128 0.099521 0.092245 0.090022 0.035549 0.101449 0.121326 0.127785 0.119303 0.206651 0.144479 0.161455 0.148839 0.148039 0.145096 0.163469 0.157829 0.159289
qa: -0.2998 -0.4906 -0.3391 0.1222 -0.0111 -0.0315 -0.2790 -0.2867 -0.3050 0.3563 -0.0034 -0.2280 -0.2256 0.0724 0.0288 -0.2594 -0.2164 0.2645 -0.1218 -0.2461 0.3274 -0.2061 -0.2650 -0.1475 -0.1118 -0.2111 0.0929 0.1055 0.0998 0.0906 0.0985 0.0915 0.1008 0.0951 0.1161 0.0995 0.0922 0.0900 0.0355 0.1014 0.1213 0.1278 0.1193 0.2067 0.1445 0.1615 0.1488 0.1480 0.1451 0.1635 0.1578 0.1593
va: 2.1118 1.9976 2.0712 3.7875 3.7659 3.7755 3.8999 3.8879 3.8362 4.1374 3.7263 3.9216 3.9001 3.8048 3.5985 3.9433 3.9617 3.7193 3.8761 4.0201 3.6435 3.8252 3.9783 3.8333 3.8526 3.8571 1.0210 1.0264 1.0025 1.0053 1.0015 1.0206 0.9984 1.0005 1.0086 0.9973 0.9965 1.0067 1.0236 1.0010 1.0037 0.9905 1.0082 0.9645 1.0003 0.9875 1.0046 1.0106 1.0098 0.9879 0.9890 0.9910
dispcorr: -0.031241824 hartree
energy: -1117.886345734775
dipole: -25.26340 24.47861 -0.78480 -3.09225 2.69947 -0.39278 -2.08968 1.20200 -0.88768
magnitude: 1.24826 au
magnitude: 3.17283 debye
