program: Orca
programVersion: 5.0.2
elementType: O O O C C C C C C C C C C C C C C C C C C C C C C C H H H H H H H H H H H H H H H H H H H H H H H H H H
charge: 0
multiplicity: 1
keywords: wb97x-d3
keywords: def2-TZVPP
keywords: def2/J RIJCOSX
keywords: DEFGRID2
keywords: scfconv7
keywords: smallprint printgap noloewdin
keywords: NOSOSCF
formula: C23H26O3
InChI: InChI=1/C23H26O3/c1-16(2)13-20-21(23(20,3)4)22(24)25-15-17-9-8-12-19(14-17)26-18-10-6-5-7-11-18/h5-14,20-21H,15H2,1-4H3
52 atoms
O  -0.068575 -0.931941 1.769836
O  -0.28137 -2.71079 0.433112
O  3.562808 1.696074 -0.845703
C  -2.145473 -0.700981 -1.122836
C  -2.971083 -1.712061 -0.402974
C  -1.907682 -0.954522 0.362276
C  -2.753279 0.63951 -1.453064
C  -1.140028 -1.159817 -2.150098
C  -4.408224 -1.475455 -0.102554
C  -0.694903 -1.643501 0.828514
C  -5.027772 -1.823388 1.028275
C  -6.485594 -1.547066 1.235682
C  -4.341703 -2.501931 2.173473
C  1.225107 -1.38372 2.1879
C  2.250252 -1.118577 1.12149
C  2.409057 0.182069 0.649988
C  3.022119 -2.146366 0.596835
C  3.32604 0.439551 -0.357619
C  3.955089 -1.87108 -0.394831
C  4.103928 -0.584869 -0.885575
C  2.577269 2.652889 -0.838894
C  2.940469 3.928197 -0.429804
C  1.288065 2.388904 -1.28716
C  2.004965 4.952396 -0.476936
C  0.360272 3.419973 -1.316438
C  0.711453 4.702344 -0.914111
H  -2.705207 -2.744955 -0.616899
H  -2.253724 -0.164019 1.018949
H  -1.971754 1.392356 -1.571777
H  -3.436531 0.993581 -0.681192
H  -3.306983 0.589239 -2.392716
H  -1.595184 -1.130377 -3.142675
H  -0.788674 -2.17611 -1.987326
H  -0.270204 -0.498372 -2.171025
H  -4.992507 -0.996504 -0.884051
H  -6.933498 -1.036062 0.383601
H  -6.641814 -0.927738 2.122702
H  -7.040555 -2.473093 1.405892
H  -3.297297 -2.735718 1.974863
H  -4.851007 -3.436005 2.423442
H  -4.384254 -1.880604 3.072022
H  1.202932 -2.438514 2.464993
H  1.4399 -0.807157 3.086403
H  1.818858 0.984226 1.076703
H  2.894331 -3.158403 0.959457
H  4.559649 -2.669367 -0.804786
H  4.820546 -0.369779 -1.668072
H  3.949778 4.117412 -0.085635
H  1.006189 1.394868 -1.614202
H  2.291238 5.948112 -0.163576
H  -0.644829 3.218251 -1.664169
H  -0.017922 5.500683 -0.945514
elementType: O C H
totalener: -1117.85469002 hartree
nucrepener: 2289.76619891 hartree
electener: -3407.62088893 hartree
oneelecener: -6069.10263324 hartree
twoeener: 2661.48174431 hartree
cpcmener: -0.03020711 hartree
kineticenergy: 1112.79237203 hartree
xcener: -110.225857977029 hartree
chargesum: 0.0000000
charge: -0.294081 -0.497202 -0.339114 0.142964 -0.008996 -0.103546 -0.280146 -0.277152 -0.305020 0.399869 -0.017040 -0.228962 -0.240204 0.098049 0.021274 -0.252760 -0.225214 0.304043 -0.111238 -0.265968 0.251858 -0.224552 -0.180023 -0.139587 -0.184287 -0.171449 0.103594 0.096441 0.082219 0.094860 0.100626 0.099674 0.095202 0.094337 0.124992 0.090082 0.094742 0.096423 0.081687 0.102572 0.099164 0.115116 0.126772 0.140331 0.146638 0.161275 0.148994 0.147903 0.184141 0.160550 0.178937 0.161213
qa: -0.2941 -0.4972 -0.3391 0.1430 -0.0090 -0.1035 -0.2801 -0.2772 -0.3050 0.3999 -0.0170 -0.2290 -0.2402 0.0980 0.0213 -0.2528 -0.2252 0.3040 -0.1112 -0.2660 0.2519 -0.2246 -0.1800 -0.1396 -0.1843 -0.1714 0.1036 0.0964 0.0822 0.0949 0.1006 0.0997 0.0952 0.0943 0.1250 0.0901 0.0947 0.0964 0.0817 0.1026 0.0992 0.1151 0.1268 0.1403 0.1466 0.1613 0.1490 0.1479 0.1841 0.1605 0.1789 0.1612
va: 2.1050 2.0017 2.0706 3.6949 3.8293 3.8094 3.9122 3.8799 3.8898 4.1474 3.7092 3.9300 3.9332 3.7955 3.6283 3.9367 3.9480 3.6891 3.8912 4.0079 3.7470 3.9839 3.9142 3.8922 3.9008 3.9073 1.0244 1.0301 1.0121 1.0030 1.0015 1.0022 1.0183 1.0010 1.0034 1.0060 0.9968 0.9962 1.0136 0.9991 0.9987 1.0097 0.9946 1.0159 1.0052 0.9877 1.0064 1.0069 0.9660 0.9881 0.9807 0.9902
dispcorr: -0.026574355 hartree
energy: -1117.881264377597
dipole: -29.14505 28.25089 -0.89416 -4.88065 5.80708 0.92642 -0.21333 0.75046 0.53713
magnitude: 1.39509 au
magnitude: 3.54605 debye
