program: Orca
programVersion: 5.0.2
elementType: O O O C C C C C C C C C C C C C C C C C C C C C C C H H H H H H H H H H H H H H H H H H H H H H H H H H
charge: 0
multiplicity: 1
keywords: wb97x-d3
keywords: def2-TZVPP
keywords: def2/J RIJCOSX
keywords: DEFGRID2
keywords: scfconv7
keywords: smallprint printgap noloewdin
keywords: NOSOSCF
formula: C23H26O3
InChI: InChI=1/C23H26O3/c1-16(2)13-20-21(23(20,3)4)22(24)25-15-17-9-8-12-19(14-17)26-18-10-6-5-7-11-18/h5-14,20-21H,15H2,1-4H3
52 atoms
O  0.754937 -2.599196 -1.087514
O  0.246377 -2.168883 1.046796
O  2.699638 2.008163 -0.529981
C  -2.711508 -2.19999 -0.049005
C  -2.23115 -0.785117 0.034061
C  -1.382695 -1.817783 -0.679944
C  -3.813551 -2.538514 -1.022352
C  -2.762861 -3.022675 1.213529
C  -2.831019 0.31554 -0.756617
C  -0.07932 -2.205143 -0.118063
C  -3.617104 1.278122 -0.266129
C  -4.139869 2.372194 -1.14547
C  -4.043892 1.357868 1.166692
C  2.105996 -2.875054 -0.737063
C  2.877928 -1.641402 -0.35273
C  2.421065 -0.367248 -0.65668
C  4.093915 -1.790693 0.309156
C  3.153093 0.740284 -0.25134
C  4.835426 -0.676941 0.667922
C  4.362556 0.602528 0.405566
C  1.461014 2.385821 -0.077706
C  0.848661 3.432569 -0.75559
C  0.845569 1.802991 1.024953
C  -0.378471 3.90754 -0.31718
C  -0.385827 2.286751 1.446678
C  -1.002322 3.339189 0.784927
H  -1.856653 -0.505335 1.014938
H  -1.399201 -1.768822 -1.763118
H  -3.798105 -3.602957 -1.263434
H  -3.733344 -1.985828 -1.95811
H  -4.788651 -2.312691 -0.585605
H  -3.758485 -2.94446 1.65417
H  -2.050139 -2.697309 1.967678
H  -2.579309 -4.078219 1.004447
H  -2.602144 0.332383 -1.818281
H  -5.231441 2.416266 -1.11545
H  -3.834134 2.246657 -2.183796
H  -3.782415 3.347849 -0.804726
H  -3.559095 0.623708 1.807031
H  -5.12231 1.203298 1.247881
H  -3.84471 2.349333 1.577858
H  2.537671 -3.327774 -1.630025
H  2.158208 -3.618445 0.061399
H  1.492962 -0.213731 -1.193623
H  4.458426 -2.782202 0.548398
H  5.780221 -0.801142 1.179668
H  4.923129 1.476482 0.71048
H  1.334548 3.874543 -1.616168
H  1.310976 0.986872 1.562109
H  -0.850834 4.723935 -0.847562
H  -0.862042 1.833551 2.306642
H  -1.960592 3.710532 1.122374
elementType: O C H
totalener: -1117.85625598 hartree
nucrepener: 2362.92817661 hartree
electener: -3480.78443259 hartree
oneelecener: -6216.07739389 hartree
twoeener: 2735.29296130 hartree
cpcmener: -0.03188057 hartree
kineticenergy: 1112.81214479 hartree
xcener: -110.234285064730 hartree
chargesum: 0.0000000
charge: -0.298931 -0.488409 -0.343531 0.168422 -0.024817 -0.079244 -0.268671 -0.298668 -0.249706 0.376171 -0.051068 -0.233535 -0.268001 0.094325 0.026919 -0.215198 -0.226719 0.253160 -0.126594 -0.229383 0.305156 -0.245945 -0.186868 -0.129077 -0.183503 -0.190279 0.095285 0.091445 0.099299 0.091814 0.096704 0.095572 0.091271 0.101948 0.123464 0.102304 0.093019 0.087323 0.093659 0.113117 0.093642 0.128885 0.119166 0.149679 0.146566 0.161553 0.149724 0.146811 0.149496 0.159413 0.165022 0.167814
qa: -0.2989 -0.4884 -0.3435 0.1684 -0.0248 -0.0792 -0.2687 -0.2987 -0.2497 0.3762 -0.0511 -0.2335 -0.2680 0.0943 0.0269 -0.2152 -0.2267 0.2532 -0.1266 -0.2294 0.3052 -0.2459 -0.1869 -0.1291 -0.1835 -0.1903 0.0953 0.0914 0.0993 0.0918 0.0967 0.0956 0.0913 0.1019 0.1235 0.1023 0.0930 0.0873 0.0937 0.1131 0.0936 0.1289 0.1192 0.1497 0.1466 0.1616 0.1497 0.1468 0.1495 0.1594 0.1650 0.1678
va: 2.1130 2.0004 2.0630 3.7415 3.7396 3.8904 3.9061 3.8995 3.7806 4.1382 3.7208 3.9172 3.9350 3.7921 3.6122 3.9490 3.9691 3.7229 3.8781 4.0109 3.6668 4.0048 3.8430 3.8924 3.8697 3.8480 1.0202 1.0387 1.0031 1.0022 1.0027 1.0010 1.0190 0.9990 1.0078 0.9980 1.0064 0.9969 1.0058 0.9999 0.9993 0.9919 1.0091 1.0107 0.9994 0.9876 1.0034 1.0077 1.0067 0.9901 0.9900 0.9815
dispcorr: -0.029454158 hartree
energy: -1117.885710142994
dipole: -29.52593 28.70098 -0.82494 -1.54244 1.08806 -0.45437 1.59412 -2.12277 -0.52865
magnitude: 1.08002 au
magnitude: 2.74520 debye
