program: Orca
programVersion: 5.0.2
elementType: O O O C C C C C C C C C C C C C C C C C C C C C C C H H H H H H H H H H H H H H H H H H H H H H H H H H
charge: 0
multiplicity: 1
keywords: wb97x-d3
keywords: def2-TZVPP
keywords: def2/J RIJCOSX
keywords: DEFGRID2
keywords: scfconv7
keywords: smallprint printgap noloewdin
keywords: NOSOSCF
formula: C23H26O3
InChI: InChI=1/C23H26O3/c1-16(2)13-20-21(23(20,3)4)22(24)25-15-17-9-8-12-19(14-17)26-18-10-6-5-7-11-18/h5-14,20-21H,15H2,1-4H3
52 atoms
O  0.330998 -2.869385 0.224336
O  0.61883 -2.724702 -1.982744
O  2.165093 1.748223 1.403661
C  -2.662147 -2.650695 -0.211382
C  -2.11242 -1.263578 -0.07652
C  -1.511661 -2.225035 -1.101434
C  -3.971933 -2.870431 -0.933222
C  -2.473749 -3.616897 0.934397
C  -2.814638 -0.056769 -0.546766
C  -0.102069 -2.637033 -1.01175
C  -2.852818 1.128749 0.072811
C  -3.634335 2.268944 -0.506962
C  -2.180303 1.436304 1.376978
C  1.740754 -3.012216 0.418836
C  2.441104 -1.697248 0.228982
C  1.968925 -0.56389 0.887604
C  3.548398 -1.593432 -0.602087
C  2.612362 0.646663 0.707649
C  4.189703 -0.372522 -0.766862
C  3.721588 0.759225 -0.118424
C  1.360721 2.653506 0.767061
C  0.805248 2.440575 -0.488601
C  1.101075 3.829337 1.463867
C  -0.010891 3.42073 -1.041555
C  0.283077 4.793779 0.898796
C  -0.277338 4.597403 -0.35788
H  -1.499789 -1.128089 0.807632
H  -1.796394 -2.03191 -2.129778
H  -4.048746 -3.907476 -1.265113
H  -4.087265 -2.237396 -1.8117
H  -4.813758 -2.674698 -0.26654
H  -2.300137 -4.632058 0.572567
H  -3.384683 -3.637759 1.535581
H  -1.658178 -3.348107 1.600292
H  -3.354111 -0.151981 -1.484465
H  -4.13477 1.997443 -1.436087
H  -2.985608 3.125807 -0.707287
H  -4.394458 2.618074 0.197023
H  -1.67553 2.403598 1.332378
H  -1.446295 0.692518 1.681336
H  -2.920744 1.513363 2.1779
H  2.154257 -3.780715 -0.235783
H  1.840199 -3.360604 1.446204
H  1.106528 -0.617746 1.542382
H  3.912225 -2.469737 -1.123822
H  5.053436 -0.299584 -1.414045
H  4.212126 1.715669 -0.246797
H  0.991161 1.528348 -1.039954
H  1.539672 3.983055 2.441861
H  -0.443801 3.251974 -2.019022
H  0.086882 5.707009 1.445309
H  -0.91329 5.353726 -0.79759
elementType: O C H
totalener: -1117.85466255 hartree
nucrepener: 2355.69787075 hartree
electener: -3473.55253330 hartree
oneelecener: -6200.97973669 hartree
twoeener: 2727.42720339 hartree
cpcmener: -0.03185555 hartree
kineticenergy: 1112.80924607 hartree
xcener: -110.231783027513 hartree
chargesum: -0.0000000
charge: -0.283676 -0.499365 -0.340906 0.108604 0.038673 -0.081196 -0.282799 -0.270385 -0.271734 0.405809 -0.065321 -0.215690 -0.262350 0.078958 -0.008336 -0.215669 -0.172595 0.205945 -0.146179 -0.163650 0.310362 -0.186044 -0.246113 -0.199756 -0.111947 -0.196114 0.102985 0.085729 0.099217 0.090674 0.097924 0.100530 0.093466 0.089247 0.120514 0.091776 0.087979 0.098898 0.070521 0.094204 0.119341 0.118528 0.118831 0.146839 0.147861 0.162366 0.156645 0.147605 0.145217 0.164034 0.158832 0.161710
qa: -0.2837 -0.4994 -0.3409 0.1086 0.0387 -0.0812 -0.2828 -0.2704 -0.2717 0.4058 -0.0653 -0.2157 -0.2624 0.0790 -0.0083 -0.2157 -0.1726 0.2059 -0.1462 -0.1637 0.3104 -0.1860 -0.2461 -0.1998 -0.1119 -0.1961 0.1030 0.0857 0.0992 0.0907 0.0979 0.1005 0.0935 0.0892 0.1205 0.0918 0.0880 0.0989 0.0705 0.0942 0.1193 0.1185 0.1188 0.1468 0.1479 0.1624 0.1566 0.1476 0.1452 0.1640 0.1588 0.1617
va: 2.1059 1.9980 2.0518 3.7040 3.7566 3.8179 3.9203 3.8996 3.8457 4.1567 3.7559 3.9092 3.9459 3.8164 3.6483 3.9832 3.9260 3.7773 3.8912 3.9634 3.6412 3.7919 3.9765 3.8683 3.8773 3.8591 1.0099 1.0332 1.0006 1.0067 1.0009 1.0009 0.9996 1.0139 1.0118 1.0094 0.9993 0.9956 1.0011 1.0061 1.0010 1.0070 0.9975 1.0119 1.0010 0.9884 0.9965 1.0095 1.0099 0.9891 0.9881 0.9895
dispcorr: -0.029261805 hartree
energy: -1117.883924356621
dipole: -24.39610 23.70273 -0.69337 -0.63810 0.69862 0.06052 1.09238 -0.28245 0.80994
magnitude: 1.06791 au
magnitude: 2.71440 debye
