program: Orca
programVersion: 5.0.2
elementType: O O O C C C C C C C C C C C C C C C C C C C C C C C H H H H H H H H H H H H H H H H H H H H H H H H H H
charge: 0
multiplicity: 1
keywords: wb97x-d3
keywords: def2-TZVPP
keywords: def2/J RIJCOSX
keywords: DEFGRID2
keywords: scfconv7
keywords: smallprint printgap noloewdin
keywords: NOSOSCF
formula: C23H26O3
InChI: InChI=1/C23H26O3/c1-16(2)13-20-21(23(20,3)4)22(24)25-15-17-9-8-12-19(14-17)26-18-10-6-5-7-11-18/h5-14,20-21H,15H2,1-4H3
52 atoms
O  0.680835 -2.073664 -1.543095
O  0.140196 -2.949118 0.440947
O  2.637416 2.18776 0.548802
C  -2.804473 -2.510973 -0.554235
C  -2.398603 -1.375927 0.328849
C  -1.507538 -1.778804 -0.845269
C  -3.892055 -2.313857 -1.583896
C  -2.793894 -3.907324 0.018534
C  -3.069769 -0.063098 0.325661
C  -0.1793 -2.339612 -0.555467
C  -3.052117 0.838051 1.31518
C  -3.815465 2.122852 1.194451
C  -2.295461 0.689886 2.599309
C  2.067415 -2.336058 -1.297449
C  2.610453 -1.401468 -0.252832
C  2.376936 -0.034762 -0.37987
C  3.314334 -1.886183 0.840805
C  2.819192 0.832405 0.607814
C  3.784088 -1.003456 1.804539
C  3.528843 0.353829 1.70348
C  1.582239 2.733082 -0.141496
C  0.287972 2.23499 -0.042192
C  1.851562 3.859851 -0.904978
C  -0.732594 2.868145 -0.737341
C  0.816621 4.49402 -1.577878
C  -0.476479 3.996447 -1.505476
H  -2.001552 -1.691953 1.28736
H  -1.5388 -1.125297 -1.709591
H  -3.823649 -3.08551 -2.352647
H  -3.834313 -1.349857 -2.087275
H  -4.878159 -2.3936 -1.122614
H  -3.794054 -4.156912 0.377554
H  -2.110938 -4.02463 0.856386
H  -2.527582 -4.642447 -0.743215
H  -3.637288 0.186216 -0.565872
H  -4.330758 2.210388 0.238192
H  -3.153766 2.985749 1.304271
H  -4.562538 2.205907 1.988349
H  -1.742461 -0.242897 2.68411
H  -2.970355 0.757167 3.455945
H  -1.579762 1.508854 2.708016
H  2.550198 -2.171657 -2.260214
H  2.227652 -3.378223 -1.01666
H  1.844478 0.341632 -1.244598
H  3.488756 -2.949654 0.943902
H  4.333568 -1.377902 2.658056
H  3.875403 1.040152 2.465557
H  0.068797 1.362234 0.561135
H  2.863319 4.239872 -0.967182
H  -1.737225 2.471767 -0.672975
H  1.029122 5.37488 -2.169198
H  -1.280257 4.484129 -2.04046
elementType: O C H
totalener: -1117.85604590 hartree
nucrepener: 2341.88026654 hartree
electener: -3459.73631245 hartree
oneelecener: -6173.44835300 hartree
twoeener: 2713.71204056 hartree
cpcmener: -0.02955367 hartree
kineticenergy: 1112.80045751 hartree
xcener: -110.230764817662 hartree
chargesum: -0.0000000
charge: -0.297054 -0.498607 -0.338101 0.108784 0.037798 -0.071830 -0.287473 -0.275231 -0.276267 0.398435 -0.070658 -0.239825 -0.264085 0.103982 0.023414 -0.265199 -0.231474 0.319103 -0.104224 -0.274489 0.304858 -0.214359 -0.259982 -0.126742 -0.114653 -0.213517 0.099908 0.092108 0.098505 0.091841 0.101773 0.096621 0.090413 0.099310 0.123121 0.095829 0.091481 0.106912 0.094173 0.108317 0.093857 0.125520 0.114642 0.142018 0.146045 0.161280 0.148320 0.162121 0.147253 0.176537 0.160772 0.158721
qa: -0.2971 -0.4986 -0.3381 0.1088 0.0378 -0.0718 -0.2875 -0.2752 -0.2763 0.3984 -0.0707 -0.2398 -0.2641 0.1040 0.0234 -0.2652 -0.2315 0.3191 -0.1042 -0.2745 0.3049 -0.2144 -0.2600 -0.1267 -0.1147 -0.2135 0.0999 0.0921 0.0985 0.0918 0.1018 0.0966 0.0904 0.0993 0.1231 0.0958 0.0915 0.1069 0.0942 0.1083 0.0939 0.1255 0.1146 0.1420 0.1460 0.1613 0.1483 0.1621 0.1473 0.1765 0.1608 0.1587
va: 2.1052 2.0032 2.0768 3.7569 3.7541 3.7702 3.9145 3.8944 3.8469 4.1559 3.7256 3.9118 3.9266 3.7962 3.6314 3.9307 3.9545 3.6863 3.8802 4.0092 3.7151 3.9212 4.0120 3.8123 3.8732 3.9680 1.0224 1.0350 1.0011 1.0057 1.0000 0.9996 1.0198 0.9995 1.0093 1.0056 0.9957 0.9984 1.0109 0.9992 0.9959 0.9941 1.0086 1.0147 1.0033 0.9873 1.0070 0.9838 1.0074 0.9808 0.9873 0.9931
dispcorr: -0.027688488 hartree
energy: -1117.883734393057
dipole: -25.77622 25.01124 -0.76498 -3.25915 3.67735 0.41820 2.54339 -3.42323 -0.87985
magnitude: 1.23863 au
magnitude: 3.14836 debye
