program: Gaussian 09
title: 000071826
version: EM64L-G09RevD.01
frameworkgroup: C1[X(C16H22ClN3O)]
method: RPBEPBE
basis: SDD
operation: Freq
keyword: #p
keyword: freq=noraman
keyword: PBEPBE/SDD
title: #p freq=noraman PBEPBE/SDD
converged: YES YES NO NO
title: Mulliken charges:
elementType: Cl O N N N C C C C C C C C C C C C C C C C H H H H H H H H H H H H H H H H H H H H H H
charge: -0.060040 -0.460086 -0.434265 -0.299066 -0.047520 -0.016817 -0.453977 -0.380829 -0.361825 -0.707390 0.391523 0.264091 -0.344687 -0.334343 -0.028205 -0.338048 -0.323938 -0.388857 -0.294757 -0.275032 -0.090628 0.209561 0.189437 0.211625 0.222415 0.195272 0.175152 0.210495 0.293009 0.212072 0.244314 0.217662 0.239830 0.204012 0.223534 0.230549 0.194960 0.210347 0.177872 0.233831 0.286813 0.254602 0.347332
chargesum: 0.00000
title: Mulliken charges with hydrogens summed into heavy atoms:
elementType: Cl O N N N C C C C C C C C C C C C C C C C
charge: -0.060040 -0.112754 -0.141256 -0.059236 -0.047520 0.192744 -0.052915 0.036858 0.023822 -0.033342 0.391523 0.264091 0.082859 -0.103793 -0.028205 -0.143088 0.064281 -0.155026 -0.007944 -0.020430 -0.090628
polarizability: 2.59004018e+02 4.15815011e+01 2.35283644e+02 -2.39237176e+01 2.69746749e+01 1.61963572e+02
1716.lowfreq: -22.2957 -8.0633 0.0011 0.0024 0.0025 3.3654 11.0880 14.0503 20.9957
frequency: -19.7014 12.1813 20.9750 40.1723 53.5653 70.8606 88.6235 100.0110 104.0298 119.4724 137.2727 149.3558 174.2577 201.7921 211.3533 222.7055 231.4075 244.9884 257.4704 271.6224 295.2320 357.4313 359.1703 393.0168 404.6286 431.2707 441.4385 471.1519 496.3508 502.9485 524.2408 529.5855 578.4673 616.6402 641.6454 646.1634 682.9774 742.3196 754.7593 758.2631 806.6089 816.1628 824.6709 828.1127 847.9059 866.0484 879.8014 897.6205 931.1371 940.9992 950.8283 971.9923 993.2474 1001.9873 1025.1764 1032.7905 1055.1926 1063.1268 1070.2922 1086.5973 1108.0271 1111.4888 1142.9724 1149.2320 1156.8182 1164.8970 1184.6778 1207.1901 1210.8316 1222.7584 1244.4951 1259.8266 1266.6888 1274.5392 1281.0953 1304.5100 1312.4067 1327.4266 1330.8965 1340.1012 1353.1573 1372.0772 1379.5430 1389.5892 1391.7371 1414.3937 1418.0773 1440.9287 1455.4999 1457.7226 1464.4928 1473.5049 1477.0046 1478.2504 1481.7082 1489.1437 1496.6696 1530.7200 1557.3988 1582.7087 1609.5792 2836.4867 2897.5046 2928.4147 2950.4610 2971.9105 2981.5806 2985.2511 2993.9187 3001.9091 3021.3343 3037.9753 3049.6129 3078.4779 3089.4048 3117.3294 3119.1300 3173.1552 3174.6836 3183.0331 3420.5000 3561.8273 3578.4914
redmass: 1.7367 6.6377 5.5146 4.8986 5.1559 4.1867 3.3189 3.9427 2.0620 4.6259 3.0367 3.2464 2.4134 2.2000 3.4925 1.4981 5.1799 4.8423 1.0779 5.5392 3.7095 2.4020 3.9437 2.1917 4.1131 2.3668 3.1962 4.2173 3.6503 3.2833 3.5281 4.7202 7.4926 5.9770 3.5090 5.9254 1.2918 2.2766 1.5301 1.8098 2.4464 2.2715 1.4313 1.2791 3.0634 1.5768 3.4212 1.4950 1.3509 2.0173 1.4114 5.1246 2.1243 2.3338 2.5460 2.6826 2.1179 1.8847 2.4264 1.7386 2.5324 2.1936 1.9361 2.3887 1.9260 1.3480 2.0433 1.4285 1.8971 1.3612 1.4497 1.3243 1.2102 1.1569 1.0896 1.2479 2.1187 1.3650 1.7276 1.6300 1.5235 2.4175 1.4415 1.2793 3.6355 2.5936 1.5225 2.4781 1.2237 1.5106 1.1357 1.1199 1.1600 1.0666 1.1869 1.1001 1.0838 4.5305 3.9962 6.5076 6.7327 1.0716 1.0702 1.0617 1.0663 1.0648 1.0396 1.0792 1.0829 1.0957 1.0937 1.0944 1.1015 1.0999 1.0995 1.0900 1.0878 1.0951 1.0932 1.0933 1.0738 1.0756 1.0666
irintensity: 3.2592 0.2533 1.5845 0.0625 0.3165 2.5858 1.0869 1.7049 5.2869 0.3931 6.7787 2.8743 6.9086 2.7531 1.1991 0.8541 1.8844 2.1384 154.1328 2.6493 1.6458 35.2762 2.7115 37.6895 7.4091 38.0395 12.6750 9.5344 6.0713 8.3869 6.8501 0.1467 11.9711 0.4481 7.7752 10.1725 98.3159 9.4344 2.7790 19.4987 32.5984 13.1648 32.0022 5.7637 48.3557 4.9902 28.1618 25.0169 0.0770 4.4120 1.3108 86.2929 2.1394 29.6923 12.3359 10.5562 4.0428 12.9442 2.9968 3.9073 17.0652 36.6356 0.8303 23.0806 65.0809 11.8203 20.5147 8.1230 37.2025 11.7067 3.6476 11.5182 4.3818 1.1386 3.9631 0.7180 6.4782 9.0416 8.1829 80.3810 5.5619 20.3401 7.9014 41.1305 57.0048 7.8307 1.4939 45.6453 37.7118 62.6766 10.7670 10.3281 15.0300 5.1909 2.2544 7.9025 6.3119 93.4753 154.1314 354.3191 78.9514 103.0654 89.2605 70.3616 22.0520 16.5593 20.3673 31.6649 41.9338 42.1605 7.2640 55.0626 70.3687 41.4022 36.7465 29.7133 17.9187 4.9442 24.0789 0.8001 2.0790 21.1141 3.7690
temp: 298.150 k
press: 1.00000 atm
elementType: 17 8 7 7 7 6 6 6 6 6 6 6 6 6 6 6 6 6 6 6 6 1 1 1 1 1 1 1 1 1 1 1 1 1 1 1 1 1 1 1 1 1 1
symmnumber: 1
zpe: 931276.6 jmol-1
zpe.correction: 0.354705 hartree
zpe.thermalcorrener: 0.376027 hartree
zpe.thermalcorrenthalpy: 0.376972 hartree
zpe.thermalcorrgfe: 0.301519 hartree
zpe.sumelectzpe: -1320.840129 hartree
zpe.sumelectthermal: -1320.818806 hartree
zpe.sumelectthermalent: -1320.817862 hartree
zpe.sumelectthermalfe: -1320.893315 hartree
dipole: 5.2728 1.4857 -1.5521
dipole: 5.6938
quadrupole: -165.5343 -125.4648 -132.0677
quadrupole: -3.7932 13.5560 -4.5797
quadrupole: -24.5120 15.5575 8.9546 -3.7932 13.5560 -4.5797
hfenergy: -1321.1948332 hartree
pointgroup: C01 [X(C16H22Cl1N3O1)]
dipole: 2.0392747 -0.7536434 0.5398699 debye
polarizability: 253.8724681|-42.8875352|240.1397098|22.4363636|28.3406642|162.2390557 unknown
InChI: InChI=1S/C16H22ClN3O/c1-12(3-2-7-18-9-10-21)20-15-6-8-19-16-11-13(17)4-5-14(15)16/h4-6,8,11-12,18,20-21H,2-3,7,9-10H2,1H3
charge 0 multiplicity 1
43 atoms
Cl -5.170572 3.756746 0.726984
O  7.995528 2.197283 -0.582849
N  -0.327442 -1.225018 0.62206
N  4.69775 0.480923 -0.361978
N  -3.990971 -0.746722 -1.563616
C  0.588676 -2.381189 0.513376
C  2.004481 -1.953699 0.969535
C  2.681997 -0.918779 0.044348
C  4.067519 -0.485701 0.561291
C  0.073205 -3.596429 1.324985
C  -1.513423 -1.077864 -0.074642
C  -2.358528 0.090795 0.143812
C  6.050337 0.928197 0.035657
C  -1.956522 -2.02458 -1.02875
C  -3.581656 0.196343 -0.626795
C  -2.043521 1.133776 1.07101
C  6.690482 1.744804 -1.091844
C  -3.17251 -1.807581 -1.730319
C  -4.437039 1.330327 -0.434319
C  -2.886257 2.235936 1.25002
C  -4.08213 2.311815 0.483317
H  0.646085 -2.660274 -0.55809
H  1.944371 -1.558169 2.007493
H  2.633589 -2.863238 1.027212
H  2.801512 -1.340718 -0.971985
H  2.029364 -0.027349 -0.061235
H  3.964072 -0.089168 1.605528
H  4.729811 -1.37229 0.627715
H  -0.109884 -0.551218 1.355976
H  0.102368 -3.37921 2.408778
H  -0.968324 -3.843743 1.055831
H  0.700892 -4.486389 1.135037
H  4.073348 1.280138 -0.544784
H  6.068104 1.537291 0.971366
H  6.673064 0.033472 0.222126
H  -1.383624 -2.930272 -1.240058
H  -1.125238 1.102391 1.670021
H  6.797346 1.108606 -1.993851
H  6.043928 2.614175 -1.349109
H  -3.499513 -2.549645 -2.46947
H  -5.352796 1.382614 -1.028136
H  -2.63734 3.027731 1.961776
H  8.478963 2.68248 -1.297024
