program: Orca
programVersion: 5.0.2
elementType: O O O C C C C C C C C C C C C C C C C C C C C C C C H H H H H H H H H H H H H H H H H H H H H H H H H H
charge: 0
multiplicity: 1
keywords: wb97x-d3
keywords: def2-TZVPP
keywords: def2/J RIJCOSX
keywords: DEFGRID2
keywords: scfconv7
keywords: smallprint printgap noloewdin
keywords: NOSOSCF
formula: C23H26O3
InChI: InChI=1/C23H26O3/c1-16(2)13-20-21(23(20,3)4)22(24)25-15-17-9-8-12-19(14-17)26-18-10-6-5-7-11-18/h5-14,20-21H,15H2,1-4H3
52 atoms
O  -1.713166 1.762261 1.261037
O  -2.675795 1.586377 -0.747552
O  2.448151 -0.335492 -0.770063
C  -4.29675 -0.796711 0.385005
C  -2.921927 -1.382852 0.31612
C  -3.154161 -0.017658 0.983644
C  -5.230554 -1.416008 1.401491
C  -5.025104 -0.339792 -0.85631
C  -2.145658 -1.498047 -0.933387
C  -2.534833 1.175169 0.370883
C  -1.005822 -2.178537 -1.082876
C  -0.308513 -2.223356 -2.409192
C  -0.302144 -2.921637 0.011709
C  -0.94747 2.85755 0.791526
C  0.17127 2.451054 -0.131199
C  0.803044 1.221401 0.000106
C  0.609471 3.342125 -1.104125
C  1.857783 0.898756 -0.841049
C  1.670237 3.013401 -1.931517
C  2.305791 1.788084 -1.803223
C  3.219516 -0.659431 0.303302
C  3.682325 0.268382 1.22825
C  3.5613 -2.002139 0.428066
C  4.481888 -0.161536 2.278776
C  4.36096 -2.412726 1.480164
C  4.824331 -1.496835 2.415072
H  -2.728244 -2.164762 1.042288
H  -3.086386 -0.028022 2.065663
H  -5.990683 -0.700786 1.720749
H  -4.700398 -1.755276 2.292838
H  -5.743247 -2.279756 0.974408
H  -5.534357 -1.191777 -1.310353
H  -4.386059 0.113545 -1.606202
H  -5.785356 0.397597 -0.594085
H  -2.532185 -0.976519 -1.800703
H  -0.224915 -3.250728 -2.77477
H  0.708962 -1.834669 -2.32488
H  -0.82952 -1.638533 -3.166095
H  -0.8393 -2.929792 0.957582
H  0.678069 -2.477422 0.199919
H  -0.121344 -3.960148 -0.276953
H  -0.538339 3.314829 1.694472
H  -1.583333 3.599577 0.302139
H  0.471752 0.501727 0.739003
H  0.105992 4.293164 -1.227233
H  1.999528 3.711145 -2.689975
H  3.129011 1.513556 -2.449421
H  3.431864 1.316649 1.136172
H  3.201691 -2.712441 -0.305527
H  4.840919 0.565167 2.995899
H  4.622334 -3.459011 1.569314
H  5.447085 -1.821173 3.237636
totalener: -1117.84381926 hartree
nucrepener: 2337.44366428 hartree
electener: -3455.28748354 hartree
oneelecener: -6163.77224062 hartree
twoeener: 2708.48475708 hartree
kineticenergy: 1112.84742250 hartree
xcener: -110.233251083941 hartree
chargesum: -0.0000000
charge: -0.279713 -0.371087 -0.311909 0.131617 -0.011892 -0.086327 -0.243334 -0.262447 -0.180954 0.324394 -0.052556 -0.211159 -0.241633 0.061819 0.079165 -0.197355 -0.163466 0.218523 -0.100919 -0.183311 0.267765 -0.166465 -0.230894 -0.132634 -0.090164 -0.151179 0.081488 0.079923 0.089039 0.069777 0.090115 0.086455 0.101811 0.083800 0.099786 0.087708 0.080016 0.081029 0.080643 0.069018 0.091625 0.104770 0.102186 0.125217 0.104761 0.124265 0.125743 0.125551 0.130584 0.124112 0.123529 0.123160
qa: -0.2797 -0.3711 -0.3119 0.1316 -0.0119 -0.0863 -0.2433 -0.2624 -0.1810 0.3244 -0.0526 -0.2112 -0.2416 0.0618 0.0792 -0.1974 -0.1635 0.2185 -0.1009 -0.1833 0.2678 -0.1665 -0.2309 -0.1326 -0.0902 -0.1512 0.0815 0.0799 0.0890 0.0698 0.0901 0.0865 0.1018 0.0838 0.0998 0.0877 0.0800 0.0810 0.0806 0.0690 0.0916 0.1048 0.1022 0.1252 0.1048 0.1243 0.1257 0.1256 0.1306 0.1241 0.1235 0.1232
va: 2.1083 2.1177 2.0433 3.7682 3.8196 3.8314 3.8998 3.9095 3.8798 4.2001 3.8023 3.9293 3.9426 3.8751 3.6638 3.9778 4.0246 3.7162 3.9538 4.0836 3.8171 3.9335 3.9794 3.9763 3.9580 3.9711 1.0091 1.0316 1.0054 1.0071 1.0044 0.9999 1.0243 1.0031 1.0184 0.9983 1.0093 1.0135 1.0186 1.0052 1.0021 0.9873 1.0110 1.0215 1.0112 1.0000 1.0101 1.0110 1.0078 1.0004 0.9996 1.0009
dispcorr: -0.027892907 hartree
energy: -1117.871712162277
dipole: -14.81588 14.99850 0.18262 -13.25397 13.31135 0.05738 -0.45857 1.11348 0.65491
magnitude: 0.68232 au
magnitude: 1.73431 debye
