program: Orca
programVersion: 5.0.2
elementType: O O O C C C C C C C C C C C C C C C C C C C C C C C H H H H H H H H H H H H H H H H H H H H H H H H H H
charge: 0
multiplicity: 1
keywords: wb97x-d3
keywords: def2-TZVPP
keywords: def2/J RIJCOSX
keywords: DEFGRID2
keywords: scfconv7
keywords: smallprint printgap noloewdin
keywords: NOSOSCF
formula: C23H26O3
InChI: InChI=1/C23H26O3/c1-16(2)13-20-21(23(20,3)4)22(24)25-15-17-9-8-12-19(14-17)26-18-10-6-5-7-11-18/h5-14,20-21H,15H2,1-4H3
52 atoms
O  -2.091311 1.590325 -1.703239
O  -0.974056 -0.34156 -1.806531
O  3.338712 1.142666 -0.237545
C  -3.082722 -1.556486 0.044698
C  -2.835478 -0.335343 0.890408
C  -3.056035 -0.203892 -0.607223
C  -4.45289 -2.185585 0.158629
C  -1.988722 -2.574774 -0.172928
C  -1.521115 0.014628 1.492409
C  -1.926852 0.287408 -1.435244
C  -0.957734 -0.609213 2.528735
C  0.338122 -0.132108 3.110643
C  -1.562986 -1.801783 3.203228
C  -0.978765 2.271805 -2.287987
C  0.09503 2.494359 -1.25945
C  1.248993 1.723428 -1.264491
C  -0.099857 3.432059 -0.248188
C  2.186456 1.872578 -0.251039
C  0.848812 3.58882 0.74803
C  1.991721 2.801768 0.758824
C  3.296606 -0.219839 -0.181265
C  4.501426 -0.872136 -0.418656
C  2.154801 -0.9495 0.125179
C  4.562541 -2.252593 -0.341474
C  2.234137 -2.333358 0.194753
C  3.429595 -2.994025 -0.034589
H  -3.688909 -0.004658 1.478677
H  -4.012285 0.22195 -0.894112
H  -4.704059 -2.739675 -0.747571
H  -5.235236 -1.442124 0.319512
H  -4.487875 -2.886628 0.995179
H  -2.080256 -3.36337 0.576875
H  -0.99034 -2.156161 -0.099295
H  -2.081282 -3.039373 -1.154818
H  -1.017503 0.892847 1.095404
H  0.22037 0.122553 4.167059
H  0.718549 0.747204 2.591974
H  1.10525 -0.908598 3.057873
H  -2.510994 -2.1026 2.761992
H  -1.736684 -1.595675 4.262437
H  -0.884155 -2.657143 3.162113
H  -1.387497 3.21985 -2.636813
H  -0.594871 1.727215 -3.152372
H  1.403527 0.984268 -2.040098
H  -0.99915 4.035525 -0.237202
H  0.696325 4.320366 1.530346
H  2.734682 2.908799 1.538314
H  5.382301 -0.290672 -0.657559
H  1.203649 -0.466697 0.303481
H  5.504465 -2.751907 -0.527144
H  1.338437 -2.893759 0.429837
H  3.479489 -4.07289 0.020937
totalener: -1117.84079999 hartree
nucrepener: 2408.70263678 hartree
electener: -3526.54343677 hartree
oneelecener: -6306.30382081 hartree
twoeener: 2779.76038404 hartree
kineticenergy: 1112.85334963 hartree
xcener: -110.234365303228 hartree
chargesum: -0.0000000
charge: -0.256219 -0.369321 -0.300110 0.067740 -0.017589 -0.083186 -0.248559 -0.214522 -0.164785 0.318872 -0.041912 -0.217322 -0.239143 0.034341 -0.050121 -0.104411 -0.146582 0.232996 -0.081009 -0.236251 0.265538 -0.204175 -0.091932 -0.099068 -0.146447 -0.148318 0.092582 0.085020 0.094587 0.071779 0.083195 0.077917 0.063660 0.101094 0.066634 0.097815 0.073792 0.091939 0.079354 0.098204 0.091473 0.111968 0.109249 0.131733 0.111366 0.126653 0.128308 0.120720 0.074706 0.120894 0.115875 0.120979
qa: -0.2562 -0.3693 -0.3001 0.0677 -0.0176 -0.0832 -0.2486 -0.2145 -0.1648 0.3189 -0.0419 -0.2173 -0.2391 0.0343 -0.0501 -0.1044 -0.1466 0.2330 -0.0810 -0.2363 0.2655 -0.2042 -0.0919 -0.0991 -0.1464 -0.1483 0.0926 0.0850 0.0946 0.0718 0.0832 0.0779 0.0637 0.1011 0.0666 0.0978 0.0738 0.0919 0.0794 0.0982 0.0915 0.1120 0.1092 0.1317 0.1114 0.1267 0.1283 0.1207 0.0747 0.1209 0.1159 0.1210
va: 2.1183 2.1160 2.1179 3.7762 3.8162 3.8289 3.9083 3.8932 3.8494 4.2294 3.7074 3.9241 3.9225 3.8807 3.6500 3.8981 3.9359 3.8187 3.8938 4.0160 3.8275 4.0024 3.8493 3.9589 3.9904 3.9861 1.0050 1.0272 1.0040 1.0074 1.0066 0.9980 1.0191 1.0131 1.0171 1.0040 1.0137 0.9981 1.0093 1.0043 0.9996 0.9937 1.0090 1.0199 1.0138 0.9983 1.0117 1.0161 1.0243 0.9989 1.0032 1.0013
dispcorr: -0.032290937 hartree
energy: -1117.873090930254
dipole: -14.96324 14.22522 -0.73802 -14.50197 14.73308 0.23111 14.15646 -13.69229 0.46417
magnitude: 0.90197 au
magnitude: 2.29261 debye
