program: Orca
programVersion: 5.0.2
elementType: O O O C C C C C C C C C C C C C C C C C C C C C C C H H H H H H H H H H H H H H H H H H H H H H H H H H
charge: 0
multiplicity: 1
keywords: wb97x-d3
keywords: def2-TZVPP
keywords: def2/J RIJCOSX
keywords: DEFGRID2
keywords: scfconv7
keywords: smallprint printgap noloewdin
keywords: NOSOSCF
formula: C23H26O3
InChI: InChI=1/C23H26O3/c1-16(2)13-20-21(23(20,3)4)22(24)25-15-17-9-8-12-19(14-17)26-18-10-6-5-7-11-18/h5-14,20-21H,15H2,1-4H3
52 atoms
O  -1.906183 2.087445 -0.422435
O  -3.020678 0.460687 -1.476475
O  2.979401 0.523433 0.705872
C  -4.950516 0.432577 0.939339
C  -3.77168 -0.35267 1.402463
C  -3.573542 1.037787 0.785349
C  -5.801315 1.074098 2.012322
C  -5.757679 -0.013672 -0.255147
C  -3.299964 -1.57992 0.715833
C  -2.848934 1.13497 -0.496623
C  -2.050445 -2.041688 0.768693
C  -1.649183 -3.297474 0.058047
C  -0.941557 -1.345495 1.494622
C  -0.990129 2.175441 -1.512193
C  0.08578 1.132429 -1.393841
C  1.087719 1.294572 -0.44383
C  0.080616 -0.002156 -2.195437
C  2.070964 0.329904 -0.291679
C  1.073783 -0.958688 -2.043888
C  2.070312 -0.806514 -1.093001
C  4.27813 0.144887 0.528399
C  4.912103 -0.478789 1.592887
C  4.972196 0.41491 -0.644929
C  6.248616 -0.830578 1.482564
C  6.305334 0.049542 -0.74458
C  6.949685 -0.574555 0.313978
H  -3.612445 -0.350774 2.477791
H  -3.322481 1.823929 1.488113
H  -6.559904 0.375109 2.369229
H  -6.315553 1.957008 1.628595
H  -5.208387 1.384156 2.8741
H  -5.161572 -0.475974 -1.035158
H  -6.276842 0.837239 -0.699434
H  -6.517374 -0.729174 0.066335
H  -4.032857 -2.137383 0.142399
H  -0.869125 -3.085292 -0.677432
H  -2.486267 -3.7615 -0.461743
H  -1.233596 -4.031124 0.753487
H  -0.499271 -1.997979 2.251563
H  -1.257482 -0.427129 1.984526
H  -0.139631 -1.087964 0.799386
H  -0.563719 3.176031 -1.439276
H  -1.509189 2.095769 -2.468568
H  1.10569 2.170428 0.193928
H  -0.707251 -0.14518 -2.921911
H  1.066812 -1.844207 -2.665838
H  2.831938 -1.566247 -0.974018
H  4.357285 -0.67865 2.500152
H  4.47865 0.908577 -1.472258
H  6.740656 -1.315353 2.315411
H  6.844699 0.2612 -1.658431
H  7.990562 -0.855428 0.228963
totalener: -1117.84417130 hartree
nucrepener: 2284.72305013 hartree
electener: -3402.56722143 hartree
oneelecener: -6058.44206944 hartree
twoeener: 2655.87484801 hartree
kineticenergy: 1112.87201222 hartree
xcener: -110.236701355156 hartree
chargesum: -0.0000000
charge: -0.266584 -0.387282 -0.301516 0.146102 -0.057191 -0.112167 -0.243820 -0.281757 -0.181232 0.353425 0.002659 -0.210494 -0.215978 0.049174 -0.005497 -0.234242 -0.086713 0.225624 -0.183510 -0.118274 0.234070 -0.208870 -0.156107 -0.092560 -0.117476 -0.142503 0.091931 0.081437 0.087760 0.090024 0.070115 0.105689 0.083986 0.086613 0.081697 0.083905 0.077881 0.083771 0.097537 0.083876 0.046970 0.106895 0.105246 0.110669 0.119852 0.132027 0.132444 0.124438 0.131281 0.124476 0.126716 0.125480
qa: -0.2666 -0.3873 -0.3015 0.1461 -0.0572 -0.1122 -0.2438 -0.2818 -0.1812 0.3534 0.0027 -0.2105 -0.2160 0.0492 -0.0055 -0.2342 -0.0867 0.2256 -0.1835 -0.1183 0.2341 -0.2089 -0.1561 -0.0926 -0.1175 -0.1425 0.0919 0.0814 0.0878 0.0900 0.0701 0.1057 0.0840 0.0866 0.0817 0.0839 0.0779 0.0838 0.0975 0.0839 0.0470 0.1069 0.1052 0.1107 0.1199 0.1320 0.1324 0.1244 0.1313 0.1245 0.1267 0.1255
va: 2.1179 2.0971 2.0923 3.7300 3.8898 3.8338 3.9030 3.9062 3.8930 4.1736 3.7438 3.9438 3.9439 3.8757 3.6824 4.0412 3.8947 3.8057 3.9478 3.8551 3.8231 4.0378 3.9383 3.9358 3.9463 3.9588 1.0055 1.0318 1.0048 1.0050 1.0073 1.0207 1.0051 0.9978 1.0128 0.9985 1.0119 0.9993 1.0060 1.0119 1.0198 0.9937 1.0120 1.0273 1.0236 1.0009 1.0041 1.0146 1.0051 0.9992 1.0001 1.0003
dispcorr: -0.027718218 hartree
energy: -1117.871889521166
dipole: -19.72656 20.21025 0.48368 -9.06237 9.07344 0.01108 5.35319 -5.19166 0.16152
magnitude: 0.51006 au
magnitude: 1.29647 debye
