program: Orca
programVersion: 5.0.2
elementType: O O O C C C C C C C C C C C C C C C C C C C C C C C H H H H H H H H H H H H H H H H H H H H H H H H H H
charge: 0
multiplicity: 1
keywords: wb97x-d3
keywords: def2-TZVPP
keywords: def2/J RIJCOSX
keywords: DEFGRID2
keywords: scfconv7
keywords: smallprint printgap noloewdin
keywords: NOSOSCF
formula: C23H26O3
InChI: InChI=1/C23H26O3/c1-16(2)13-20-21(23(20,3)4)22(24)25-15-17-9-8-12-19(14-17)26-18-10-6-5-7-11-18/h5-14,20-21H,15H2,1-4H3
52 atoms
O  -1.895591 0.105648 -1.229464
O  -2.985785 2.054764 -1.221135
O  3.079221 0.621361 0.858674
C  -4.372363 -1.135445 0.039445
C  -3.520815 -0.688826 1.179854
C  -3.868238 0.294259 0.065686
C  -5.854506 -1.286659 0.297663
C  -3.852199 -2.144474 -0.955536
C  -2.162791 -1.233766 1.431989
C  -2.886659 0.912755 -0.851288
C  -1.160111 -0.573673 2.011729
C  0.130567 -1.25795 2.344662
C  -1.228484 0.875486 2.382204
C  -0.869971 0.66076 -2.053236
C  0.164057 1.383386 -1.235806
C  1.163658 0.65281 -0.603615
C  0.117964 2.764168 -1.077298
C  2.115088 1.301513 0.171654
C  1.068654 3.401515 -0.295215
C  2.072936 2.6790 0.328976
C  3.718413 -0.433586 0.275478
C  3.994253 -1.532088 1.076756
C  4.135452 -0.406566 -1.049605
C  4.693924 -2.606176 0.548968
C  4.826189 -1.491704 -1.566127
C  5.108925 -2.594602 -0.773796
H  -4.069763 -0.466496 2.092586
H  -4.619953 1.027752 0.33377
H  -6.429391 -1.149334 -0.619961
H  -6.218034 -0.561613 1.026957
H  -6.07765 -2.282766 0.684857
H  -4.301462 -1.983251 -1.936903
H  -4.130514 -3.149343 -0.631504
H  -2.773789 -2.123289 -1.076155
H  -2.011444 -2.279879 1.182596
H  0.270924 -1.308336 3.427825
H  0.985477 -0.707261 1.949979
H  0.170871 -2.274778 1.955696
H  -2.205736 1.317685 2.199595
H  -0.493352 1.447684 1.809387
H  -0.98406 1.02124 3.437276
H  -1.296688 1.316702 -2.813338
H  -0.42493 -0.197615 -2.555864
H  1.193364 -0.425345 -0.711324
H  -0.66781 3.334168 -1.552911
H  1.031681 4.475765 -0.172423
H  2.820161 3.171263 0.937211
H  3.664806 -1.535853 2.107521
H  3.927693 0.453889 -1.67229
H  4.908872 -3.45989 1.177907
H  5.152885 -1.467952 -2.597358
H  5.650954 -3.435975 -1.183553
totalener: -1117.84097133 hartree
nucrepener: 2345.58351833 hartree
electener: -3463.42448965 hartree
oneelecener: -6179.89413990 hartree
twoeener: 2716.46965025 hartree
kineticenergy: 1112.86696010 hartree
xcener: -110.236513642496 hartree
chargesum: 0.0000000
charge: -0.248842 -0.381051 -0.307609 0.145936 -0.043613 -0.159539 -0.246816 -0.282680 -0.187634 0.376481 -0.011967 -0.204367 -0.233852 0.014253 -0.007395 -0.178179 -0.115704 0.215444 -0.105230 -0.204066 0.248618 -0.210117 -0.158357 -0.091833 -0.120247 -0.144482 0.097569 0.090870 0.091010 0.071495 0.085481 0.093659 0.086928 0.092484 0.085684 0.096490 0.052569 0.082603 0.090129 0.080553 0.094385 0.115230 0.097448 0.122037 0.127379 0.125757 0.127322 0.128384 0.130364 0.125108 0.126662 0.125246
qa: -0.2488 -0.3811 -0.3076 0.1459 -0.0436 -0.1595 -0.2468 -0.2827 -0.1876 0.3765 -0.0120 -0.2044 -0.2339 0.0143 -0.0074 -0.1782 -0.1157 0.2154 -0.1052 -0.2041 0.2486 -0.2101 -0.1584 -0.0918 -0.1202 -0.1445 0.0976 0.0909 0.0910 0.0715 0.0855 0.0937 0.0869 0.0925 0.0857 0.0965 0.0526 0.0826 0.0901 0.0806 0.0944 0.1152 0.0974 0.1220 0.1274 0.1258 0.1273 0.1284 0.1304 0.1251 0.1267 0.1252
va: 2.1066 2.1238 2.0725 3.6971 3.8370 3.8477 3.9127 3.9157 3.8647 4.1892 3.7500 3.9302 3.9509 3.8943 3.6756 3.8818 3.9500 3.7570 3.9625 4.0422 3.8119 4.0138 3.9396 3.9451 3.9488 3.9646 1.0057 1.0281 1.0039 1.0088 1.0042 1.0041 0.9998 1.0136 1.0091 1.0018 1.0095 1.0092 1.0089 1.0085 1.0039 1.0091 0.9994 1.0136 1.0245 1.0003 1.0124 1.0115 1.0058 0.9993 1.0002 1.0004
dispcorr: -0.029812761 hartree
energy: -1117.870784085849
dipole: -15.66658 15.96032 0.29374 -10.75955 9.97996 -0.77959 6.23532 -6.29130 -0.05598
magnitude: 0.83497 au
magnitude: 2.12233 debye
