program: Orca
programVersion: 5.0.2
elementType: O O O C C C C C C C C C C C C C C C C C C C C C C C H H H H H H H H H H H H H H H H H H H H H H H H H H
charge: 0
multiplicity: 1
keywords: wb97x-d3
keywords: def2-TZVPP
keywords: def2/J RIJCOSX
keywords: DEFGRID2
keywords: scfconv7
keywords: smallprint printgap noloewdin
keywords: NOSOSCF
formula: C23H26O3
InChI: InChI=1/C23H26O3/c1-16(2)13-20-21(23(20,3)4)22(24)25-15-17-9-8-12-19(14-17)26-18-10-6-5-7-11-18/h5-14,20-21H,15H2,1-4H3
52 atoms
O  -2.342202 0.674188 -1.310309
O  -3.11145 2.584161 -0.436866
O  3.165804 -0.395453 -1.277526
C  -4.756369 -0.776424 -0.259173
C  -3.857976 -0.670851 0.927132
C  -4.216218 0.584026 0.126537
C  -6.233061 -0.952557 0.020766
C  -4.326328 -1.510034 -1.507056
C  -2.473609 -1.205183 0.9447
C  -3.181485 1.388021 -0.561062
C  -1.495519 -0.735822 1.719004
C  -0.118957 -1.321739 1.682481
C  -1.666826 0.420068 2.656036
C  -1.286972 1.350464 -1.993711
C  -0.007179 1.353362 -1.204025
C  1.003558 0.462785 -1.535804
C  0.188104 2.24923 -0.154942
C  2.209295 0.471723 -0.844577
C  1.388386 2.244128 0.535653
C  2.408711 1.365331 0.198808
C  4.123939 -0.835388 -0.407904
C  5.453631 -0.671783 -0.763053
C  3.783318 -1.475164 0.7776
C  6.449033 -1.154699 0.074167
C  4.786624 -1.94559 1.60899
C  6.121726 -1.786984 1.263587
H  -4.363021 -0.705931 1.889276
H  -4.932615 1.24047 0.606952
H  -6.834913 -0.571094 -0.805974
H  -6.544528 -0.428137 0.925044
H  -6.476799 -2.008432 0.151355
H  -3.256161 -1.494345 -1.684126
H  -4.813807 -1.086722 -2.386786
H  -4.637153 -2.554091 -1.433617
H  -2.253938 -2.038294 0.285177
H  0.603658 -0.561023 1.376234
H  -0.046531 -2.157001 0.986522
H  0.189434 -1.674069 2.670454
H  -1.477025 0.114777 3.688369
H  -2.659357 0.863601 2.614132
H  -0.942979 1.204794 2.423753
H  -1.586578 2.368763 -2.244505
H  -1.149743 0.798211 -2.923496
H  0.869954 -0.24296 -2.347015
H  -0.589458 2.953465 0.107863
H  1.545988 2.947007 1.343339
H  3.346093 1.389567 0.738731
H  5.701383 -0.173456 -1.691037
H  2.742819 -1.608983 1.045229
H  7.486596 -1.02768 -0.205023
H  4.520597 -2.445122 2.531167
H  6.900589 -2.157978 1.915755
totalener: -1117.84051742 hartree
nucrepener: 2312.42600274 hartree
electener: -3430.26652015 hartree
oneelecener: -6113.44453383 hartree
twoeener: 2683.17801368 hartree
kineticenergy: 1112.86145517 hartree
xcener: -110.236603925390 hartree
chargesum: 0.0000000
charge: -0.250819 -0.382744 -0.296279 0.146450 -0.057280 -0.141046 -0.248425 -0.268971 -0.177481 0.365974 -0.015193 -0.201610 -0.248955 0.015114 0.063397 -0.220002 -0.209841 0.210436 -0.124474 -0.134376 0.161097 -0.153801 -0.089662 -0.122739 -0.171381 -0.109841 0.093484 0.089409 0.092009 0.072163 0.086395 0.083703 0.091005 0.088072 0.082723 0.047142 0.089294 0.101723 0.096373 0.088128 0.089914 0.123044 0.089060 0.104465 0.150225 0.130437 0.126377 0.126140 0.143197 0.126248 0.125196 0.126524
qa: -0.2508 -0.3827 -0.2963 0.1464 -0.0573 -0.1410 -0.2484 -0.2690 -0.1775 0.3660 -0.0152 -0.2016 -0.2490 0.0151 0.0634 -0.2200 -0.2098 0.2104 -0.1245 -0.1344 0.1611 -0.1538 -0.0897 -0.1227 -0.1714 -0.1098 0.0935 0.0894 0.0920 0.0722 0.0864 0.0837 0.0910 0.0881 0.0827 0.0471 0.0893 0.1017 0.0964 0.0881 0.0899 0.1230 0.0891 0.1045 0.1502 0.1304 0.1264 0.1261 0.1432 0.1262 0.1252 0.1265
va: 2.1040 2.1189 2.1054 3.7123 3.8690 3.8348 3.9091 3.9088 3.8696 4.1990 3.7790 3.9227 3.9386 3.8733 3.6411 4.0483 3.9000 3.8729 3.9250 3.8683 3.8688 3.9999 3.8985 3.9503 4.0128 3.9294 1.0059 1.0282 1.0041 1.0081 1.0046 1.0180 1.0048 0.9999 1.0142 1.0019 1.0054 1.0019 1.0011 1.0107 1.0060 1.0109 1.0034 1.0252 1.0200 1.0020 1.0094 1.0119 0.9887 0.9995 1.0025 0.9998
dispcorr: -0.029458595 hartree
energy: -1117.869976011697
dipole: -17.27199 17.65061 0.37862 -8.36919 7.66592 -0.70326 8.87478 -8.57967 0.29511
magnitude: 0.85148 au
magnitude: 2.16429 debye
