program: Orca
programVersion: 5.0.2
elementType: O O O C C C C C C C C C C C C C C C C C C C C C C C H H H H H H H H H H H H H H H H H H H H H H H H H H
charge: 0
multiplicity: 1
keywords: wb97x-d3
keywords: def2-TZVPP
keywords: def2/J RIJCOSX
keywords: DEFGRID2
keywords: scfconv7
keywords: smallprint printgap noloewdin
keywords: NOSOSCF
formula: C23H26O3
InChI: InChI=1/C23H26O3/c1-16(2)13-20-21(23(20,3)4)22(24)25-15-17-9-8-12-19(14-17)26-18-10-6-5-7-11-18/h5-14,20-21H,15H2,1-4H3
52 atoms
O  -1.499301 2.258833 0.163681
O  -0.541254 0.434321 1.027887
O  3.645443 0.789344 -1.569881
C  -2.820716 -1.090653 -0.446277
C  -3.39588 -0.807345 0.907643
C  -2.754836 0.321078 0.103014
C  -3.798945 -1.291958 -1.579945
C  -1.582785 -1.941791 -0.586381
C  -2.814901 -1.337015 2.15481
C  -1.482456 0.962648 0.494082
C  -3.494193 -1.902418 3.156716
C  -2.773331 -2.410571 4.370694
C  -4.980578 -2.094151 3.200535
C  -0.2963 3.006056 0.361791
C  0.668024 2.767613 -0.765141
C  1.731769 1.890111 -0.60601
C  0.467996 3.394291 -1.991092
C  2.573642 1.622915 -1.67826
C  1.324864 3.138468 -3.048394
C  2.37457 2.245007 -2.901728
C  3.547777 -0.384795 -0.881199
C  2.384224 -1.143995 -0.841841
C  4.70012 -0.833079 -0.249654
C  2.385439 -2.351998 -0.16185
C  4.688065 -2.047205 0.417876
C  3.531445 -2.811381 0.469308
H  -4.476565 -0.719769 0.918546
H  -3.459505 1.015791 -0.338794
H  -3.342818 -1.039943 -2.539069
H  -4.691195 -0.675078 -1.465332
H  -4.121641 -2.333611 -1.627741
H  -0.873393 -1.822267 0.226435
H  -1.063677 -1.707607 -1.518254
H  -1.872118 -2.993415 -0.627111
H  -1.740588 -1.262382 2.262828
H  -3.128965 -1.912592 5.276492
H  -1.697757 -2.254018 4.304257
H  -2.949436 -3.479661 4.51495
H  -5.226869 -3.152102 3.317888
H  -5.499768 -1.737562 2.314298
H  -5.409793 -1.580183 4.063895
H  0.153116 2.771052 1.327742
H  -0.618075 4.047106 0.380375
H  1.885322 1.399599 0.346425
H  -0.35899 4.081908 -2.117979
H  1.172258 3.629742 -4.000171
H  3.043084 2.03027 -3.724967
H  1.480556 -0.800715 -1.327652
H  5.597835 -0.230228 -0.290186
H  1.47595 -2.93759 -0.130559
H  5.589228 -2.392824 0.907096
H  3.523103 -3.755544 0.996572
totalener: -1117.84521660 hartree
nucrepener: 2284.82333117 hartree
electener: -3402.66854776 hartree
oneelecener: -6058.55729503 hartree
twoeener: 2655.88874726 hartree
kineticenergy: 1112.85752710 hartree
xcener: -110.234467279516 hartree
chargesum: 0.0000000
charge: -0.265749 -0.411529 -0.300592 0.118419 0.024258 -0.099415 -0.241065 -0.291067 -0.218392 0.381137 -0.052965 -0.204922 -0.242694 0.050395 -0.006895 -0.150487 -0.192906 0.236972 -0.084682 -0.215426 0.264886 -0.158542 -0.226033 -0.098229 -0.084480 -0.159842 0.087527 0.081675 0.090059 0.070741 0.088918 0.092037 0.090424 0.095322 0.111712 0.082044 0.081785 0.080846 0.085560 0.076564 0.087450 0.108355 0.109213 0.134007 0.109669 0.124687 0.125193 0.125366 0.121807 0.124425 0.122557 0.121905
qa: -0.2657 -0.4115 -0.3006 0.1184 0.0243 -0.0994 -0.2411 -0.2911 -0.2184 0.3811 -0.0530 -0.2049 -0.2427 0.0504 -0.0069 -0.1505 -0.1929 0.2370 -0.0847 -0.2154 0.2649 -0.1585 -0.2260 -0.0982 -0.0845 -0.1598 0.0875 0.0817 0.0901 0.0707 0.0889 0.0920 0.0904 0.0953 0.1117 0.0820 0.0818 0.0808 0.0856 0.0766 0.0875 0.1084 0.1092 0.1340 0.1097 0.1247 0.1252 0.1254 0.1218 0.1244 0.1226 0.1219
va: 2.1362 2.0641 2.1145 3.7104 3.7934 3.8895 3.9100 3.9375 3.8931 4.1329 3.8101 3.9387 3.9463 3.8638 3.6709 3.8942 4.0265 3.8430 3.9298 4.0563 3.8388 3.9416 4.0393 3.9426 3.9347 3.9977 1.0102 1.0306 1.0046 1.0087 1.0037 1.0097 0.9971 1.0047 1.0259 0.9981 1.0126 0.9981 0.9996 1.0168 0.9987 1.0118 0.9937 1.0227 1.0124 0.9991 1.0129 1.0006 1.0154 0.9992 0.9987 1.0020
dispcorr: -0.025504016 hartree
energy: -1117.870720613731
dipole: -25.01509 24.14439 -0.87070 -16.69564 16.73881 0.04317 10.43862 -10.54979 -0.11118
magnitude: 0.87883 au
magnitude: 2.23382 debye
