program: Orca
programVersion: 5.0.2
elementType: O O O C C C C C C C C C C C C C C C C C C C C C C C H H H H H H H H H H H H H H H H H H H H H H H H H H
charge: 0
multiplicity: 1
keywords: wb97x-d3
keywords: def2-TZVPP
keywords: def2/J RIJCOSX
keywords: DEFGRID2
keywords: scfconv7
keywords: smallprint printgap noloewdin
keywords: NOSOSCF
formula: C23H26O3
InChI: InChI=1/C23H26O3/c1-16(2)13-20-21(23(20,3)4)22(24)25-15-17-9-8-12-19(14-17)26-18-10-6-5-7-11-18/h5-14,20-21H,15H2,1-4H3
52 atoms
O  -1.904496 0.845083 -1.70207
O  -3.052755 -0.949393 -1.018147
O  3.093903 0.769211 0.187722
C  -5.08291 1.022776 0.217298
C  -3.981502 0.960893 1.219247
C  -3.661608 1.239921 -0.253101
C  -5.940312 2.268576 0.22289
C  -5.858251 -0.217391 -0.154795
C  -3.565926 -0.298955 1.883563
C  -2.884587 0.240753 -1.011638
C  -2.33922 -0.541877 2.345899
C  -2.004714 -1.830509 3.032183
C  -1.197905 0.416491 2.201679
C  -0.965458 0.002554 -2.367549
C  0.082959 -0.499652 -1.41423
C  1.139563 0.333985 -1.06021
C  0.005235 -1.772471 -0.861947
C  2.099439 -0.099639 -0.161968
C  0.971715 -2.199303 0.038038
C  2.020446 -1.368885 0.397616
C  4.395901 0.413825 -0.002865
C  5.339847 1.080405 0.768945
C  4.798196 -0.530271 -0.94016
C  6.685526 0.800984 0.599879
C  6.149897 -0.803707 -1.091881
C  7.0999 -0.144799 -0.327681
H  -3.873193 1.849252 1.836871
H  -3.392486 2.264963 -0.481016
H  -6.76278 2.164186 0.933089
H  -6.372402 2.451395 -0.762735
H  -5.371877 3.155902 0.505533
H  -5.262615 -1.124298 -0.138064
H  -6.276334 -0.116582 -1.157777
H  -6.693815 -0.343419 0.53699
H  -4.326753 -1.061959 2.011865
H  -2.862141 -2.499784 3.089316
H  -1.644536 -1.654814 4.049073
H  -1.203057 -2.350807 2.501822
H  -0.776864 0.671252 3.177887
H  -1.47644 1.343803 1.704824
H  -0.388767 -0.03775 1.62369
H  -0.514624 0.635974 -3.131555
H  -1.469375 -0.826143 -2.867278
H  1.221628 1.32931 -1.480887
H  -0.819576 -2.421455 -1.120916
H  0.903873 -3.188801 0.470909
H  2.771167 -1.700733 1.103496
H  5.012349 1.815089 1.492746
H  4.071977 -1.048074 -1.552598
H  7.415455 1.324526 1.20336
H  6.458112 -1.539315 -1.823162
H  8.151269 -0.364177 -0.453881
totalener: -1117.84421787 hartree
nucrepener: 2271.59132978 hartree
electener: -3389.43554764 hartree
oneelecener: -6032.10319800 hartree
twoeener: 2642.66765036 hartree
kineticenergy: 1112.85762448 hartree
xcener: -110.233530834792 hartree
chargesum: -0.0000000
charge: -0.265315 -0.390577 -0.300720 0.139014 -0.054527 -0.113248 -0.243929 -0.280741 -0.186210 0.358248 0.001910 -0.207947 -0.213255 0.043594 -0.014345 -0.192256 -0.093115 0.188539 -0.163045 -0.125969 0.256270 -0.216338 -0.155744 -0.090242 -0.130134 -0.148411 0.094011 0.082845 0.087655 0.090151 0.070502 0.105534 0.085180 0.086732 0.081735 0.078572 0.084677 0.080640 0.097595 0.084689 0.049465 0.105426 0.108503 0.110375 0.126133 0.130783 0.133560 0.122838 0.128596 0.123674 0.124760 0.123864
qa: -0.2653 -0.3906 -0.3007 0.1390 -0.0545 -0.1132 -0.2439 -0.2807 -0.1862 0.3582 0.0019 -0.2079 -0.2133 0.0436 -0.0143 -0.1923 -0.0931 0.1885 -0.1630 -0.1260 0.2563 -0.2163 -0.1557 -0.0902 -0.1301 -0.1484 0.0940 0.0828 0.0877 0.0902 0.0705 0.1055 0.0852 0.0867 0.0817 0.0786 0.0847 0.0806 0.0976 0.0847 0.0495 0.1054 0.1085 0.1104 0.1261 0.1308 0.1336 0.1228 0.1286 0.1237 0.1248 0.1239
va: 2.1192 2.0917 2.0975 3.7329 3.8928 3.8273 3.9034 3.9062 3.8940 4.1619 3.7452 3.9436 3.9443 3.8749 3.6584 4.0531 3.8769 3.8653 3.9258 3.9097 3.8055 4.0288 3.9071 3.9438 3.9662 3.9623 1.0054 1.0314 1.0048 1.0049 1.0074 1.0200 1.0049 0.9978 1.0125 1.0115 0.9992 0.9992 1.0055 1.0113 1.0185 0.9948 1.0107 1.0238 1.0251 1.0015 1.0021 1.0154 1.0079 0.9988 1.0006 1.0007
dispcorr: -0.027435183 hartree
energy: -1117.871653048244
dipole: -21.09746 21.35722 0.25976 -0.55799 0.68586 0.12787 9.82390 -9.84062 -0.01672
magnitude: 0.29001 au
magnitude: 0.73716 debye
