program: Orca
programVersion: 5.0.2
elementType: O O O C C C C C C C C C C C C C C C C C C C C C C C H H H H H H H H H H H H H H H H H H H H H H H H H H
charge: 0
multiplicity: 1
keywords: wb97x-d3
keywords: def2-TZVPP
keywords: def2/J RIJCOSX
keywords: DEFGRID2
keywords: scfconv7
keywords: smallprint printgap noloewdin
keywords: NOSOSCF
formula: C23H26O3
InChI: InChI=1/C23H26O3/c1-16(2)13-20-21(23(20,3)4)22(24)25-15-17-9-8-12-19(14-17)26-18-10-6-5-7-11-18/h5-14,20-21H,15H2,1-4H3
52 atoms
O  -1.917411 2.200527 0.176511
O  -3.067793 0.885201 -1.22061
O  3.301014 1.150776 0.086482
C  -4.720905 0.002214 1.238159
C  -3.480459 -0.820141 1.318465
C  -3.381001 0.699436 1.149911
C  -5.471123 0.240755 2.528703
C  -5.636559 -0.102231 0.043037
C  -3.068943 -1.749235 0.23687
C  -2.812985 1.240741 -0.10113
C  -1.808129 -2.06219 -0.060987
C  -1.478825 -3.005498 -1.176386
C  -0.624072 -1.481136 0.647845
C  -1.163175 2.724542 -0.915577
C  -0.000859 1.831601 -1.249774
C  1.126576 1.850338 -0.436908
C  -0.04832 0.960499 -2.331893
C  2.205322 1.024662 -0.713591
C  1.034484 0.136361 -2.601439
C  2.166672 0.161424 -1.802617
C  4.048104 0.057189 0.412543
C  3.473188 -1.159988 0.759025
C  5.426021 0.217805 0.444274
C  4.291479 -2.215996 1.128803
C  6.231216 -0.843954 0.825988
C  5.670434 -2.066727 1.163538
H  -3.204729 -1.142731 2.319701
H  -3.076004 1.243449 2.036475
H  -6.169507 -0.575116 2.723614
H  -6.046833 1.166685 2.480344
H  -4.800892 0.312158 3.386368
H  -6.198315 0.824482 -0.085847
H  -6.360804 -0.902573 0.209107
H  -5.116644 -0.301164 -0.888472
H  -3.863671 -2.204776 -0.345069
H  -0.885083 -2.49762 -1.940478
H  -2.372542 -3.403761 -1.655081
H  -0.879948 -3.848226 -0.82201
H  -0.006632 -2.27351 1.080465
H  -0.895594 -0.794754 1.447005
H  0.008266 -0.934862 -0.056754
H  -0.81033 3.696532 -0.570781
H  -1.798163 2.883048 -1.788398
H  1.179077 2.51616 0.416387
H  -0.932125 0.919894 -2.953335
H  1.001534 -0.534272 -3.450111
H  3.009964 -0.477321 -2.030886
H  2.397563 -1.282918 0.747366
H  5.856852 1.173394 0.175358
H  3.842101 -3.162453 1.399729
H  7.305052 -0.713343 0.851579
H  6.301233 -2.894951 1.456051
totalener: -1117.84403900 hartree
nucrepener: 2307.98620202 hartree
electener: -3425.83024102 hartree
oneelecener: -6104.79130590 hartree
twoeener: 2678.96106488 hartree
kineticenergy: 1112.86033519 hartree
xcener: -110.235426029136 hartree
chargesum: -0.0000000
charge: -0.265416 -0.386605 -0.298257 0.139248 -0.053797 -0.118066 -0.244699 -0.280432 -0.174669 0.353521 -0.005454 -0.210995 -0.201524 0.044360 -0.011262 -0.203120 -0.113082 0.215217 -0.150986 -0.135581 0.183347 -0.088041 -0.177547 -0.165325 -0.113273 -0.118824 0.094222 0.083692 0.087689 0.089864 0.070653 0.085220 0.085997 0.106004 0.082107 0.083797 0.079005 0.082718 0.097104 0.092834 0.026784 0.106276 0.107320 0.109481 0.122879 0.128730 0.130793 0.129506 0.124933 0.123355 0.125132 0.125168
qa: -0.2654 -0.3866 -0.2983 0.1392 -0.0538 -0.1181 -0.2447 -0.2804 -0.1747 0.3535 -0.0055 -0.2110 -0.2015 0.0444 -0.0113 -0.2031 -0.1131 0.2152 -0.1510 -0.1356 0.1833 -0.0880 -0.1775 -0.1653 -0.1133 -0.1188 0.0942 0.0837 0.0877 0.0899 0.0707 0.0852 0.0860 0.1060 0.0821 0.0838 0.0790 0.0827 0.0971 0.0928 0.0268 0.1063 0.1073 0.1095 0.1229 0.1287 0.1308 0.1295 0.1249 0.1234 0.1251 0.1252
va: 2.1187 2.0964 2.1090 3.7299 3.8929 3.8242 3.9044 3.9072 3.9015 4.1717 3.7387 3.9397 3.9291 3.8725 3.6831 4.0211 3.8866 3.8667 3.9297 3.8845 3.8630 3.8747 4.0038 4.0024 3.9537 3.9374 1.0055 1.0314 1.0048 1.0048 1.0072 1.0052 0.9979 1.0198 1.0103 1.0001 1.0118 0.9992 1.0024 1.0123 1.0182 0.9952 1.0114 1.0256 1.0249 1.0022 1.0048 0.9926 1.0139 1.0025 0.9993 1.0004
dispcorr: -0.028558874 hartree
energy: -1117.872597870504
dipole: -19.34432 19.59436 0.25004 -12.47595 12.23257 -0.24338 4.22473 -3.90378 0.32095
magnitude: 0.47409 au
magnitude: 1.20504 debye
