program: Orca
programVersion: 5.0.2
elementType: O O O C C C C C C C C C C C C C C C C C C C C C C C H H H H H H H H H H H H H H H H H H H H H H H H H H
charge: 0
multiplicity: 1
keywords: wb97x-d3
keywords: def2-TZVPP
keywords: def2/J RIJCOSX
keywords: DEFGRID2
keywords: scfconv7
keywords: smallprint printgap noloewdin
keywords: NOSOSCF
formula: C23H26O3
InChI: InChI=1/C23H26O3/c1-16(2)13-20-21(23(20,3)4)22(24)25-15-17-9-8-12-19(14-17)26-18-10-6-5-7-11-18/h5-14,20-21H,15H2,1-4H3
52 atoms
O  -1.477818 2.414065 0.342729
O  -0.568548 0.438566 0.846831
O  3.561394 0.670955 -1.890379
C  -3.313193 -0.62495 -0.270439
C  -3.477353 -0.592681 1.218947
C  -2.940316 0.633116 0.492332
C  -4.563759 -0.51954 -1.111076
C  -2.253843 -1.500137 -0.892523
C  -2.66128 -1.416755 2.133085
C  -1.54164 1.099921 0.592179
C  -3.137645 -2.27557 3.038226
C  -2.200563 -3.057897 3.910248
C  -4.589247 -2.559028 3.282889
C  -0.176441 2.997979 0.292062
C  0.577767 2.572421 -0.936458
C  1.733456 1.816299 -0.815838
C  0.105553 2.916228 -2.199221
C  2.408158 1.393006 -1.953794
C  0.791419 2.501065 -3.328643
C  1.939644 1.732609 -3.213991
C  3.711957 -0.317214 -0.960613
C  4.993188 -0.515263 -0.464094
C  2.664854 -1.134958 -0.551985
C  5.227829 -1.539377 0.439356
C  2.914021 -2.149225 0.359818
C  4.190931 -2.359509 0.858912
H  -4.500208 -0.440927 1.547085
H  -3.648356 1.447634 0.392934
H  -5.326604 0.098246 -0.635243
H  -4.997025 -1.507107 -1.280602
H  -4.343568 -0.081098 -2.086199
H  -1.956153 -1.108502 -1.866909
H  -2.658093 -2.502065 -1.04639
H  -1.358174 -1.596614 -0.286488
H  -1.586701 -1.315907 2.056388
H  -2.387189 -2.857568 4.968559
H  -1.15757 -2.820851 3.704686
H  -2.336101 -4.133416 3.769209
H  -4.80238 -3.61949 3.127025
H  -5.262624 -1.997217 2.639646
H  -4.858061 -2.339677 4.319232
H  0.388508 2.763938 1.19674
H  -0.362062 4.072106 0.27928
H  2.089498 1.536038 0.167385
H  -0.797845 3.504832 -2.299573
H  0.426522 2.768091 -4.311609
H  2.474824 1.395628 -4.091894
H  5.796702 0.130961 -0.792229
H  1.660948 -0.981576 -0.925827
H  6.228622 -1.689749 0.822346
H  2.095209 -2.780012 0.679677
H  4.375674 -3.15387 1.569205
totalener: -1117.84498983 hartree
nucrepener: 2273.06186828 hartree
electener: -3390.90685811 hartree
oneelecener: -6035.09828316 hartree
twoeener: 2644.19142505 hartree
kineticenergy: 1112.85589011 hartree
xcener: -110.233891013863 hartree
chargesum: 0.0000000
charge: -0.269055 -0.409929 -0.300862 0.110534 0.015811 -0.109441 -0.244153 -0.252490 -0.231889 0.377290 -0.030865 -0.210589 -0.243618 0.057433 0.006977 -0.140753 -0.213675 0.235844 -0.076786 -0.217207 0.261062 -0.222050 -0.157462 -0.088432 -0.111066 -0.149536 0.087783 0.081690 0.070878 0.087993 0.089864 0.091760 0.089732 0.086825 0.117123 0.082433 0.080414 0.081448 0.085459 0.075887 0.087531 0.101011 0.113751 0.121471 0.113324 0.124013 0.125056 0.122789 0.128218 0.123146 0.122921 0.122385
qa: -0.2691 -0.4099 -0.3009 0.1105 0.0158 -0.1094 -0.2442 -0.2525 -0.2319 0.3773 -0.0309 -0.2106 -0.2436 0.0574 0.0070 -0.1408 -0.2137 0.2358 -0.0768 -0.2172 0.2611 -0.2220 -0.1575 -0.0884 -0.1111 -0.1495 0.0878 0.0817 0.0709 0.0880 0.0899 0.0918 0.0897 0.0868 0.1171 0.0824 0.0804 0.0814 0.0855 0.0759 0.0875 0.1010 0.1138 0.1215 0.1133 0.1240 0.1251 0.1228 0.1282 0.1231 0.1229 0.1224
va: 2.1308 2.0721 2.1124 3.7258 3.7974 3.9159 3.9107 3.9331 3.9006 4.1388 3.7741 3.9414 3.9476 3.8650 3.6621 3.9059 4.0127 3.8531 3.9158 4.0507 3.8108 4.0359 3.9335 3.9321 3.9517 3.9648 1.0098 1.0307 1.0083 1.0041 1.0048 1.0018 1.0049 1.0171 1.0262 0.9980 1.0124 0.9980 0.9996 1.0152 0.9986 1.0110 0.9900 1.0188 1.0154 0.9989 1.0128 1.0151 1.0041 0.9989 1.0003 1.0008
dispcorr: -0.024857055 hartree
energy: -1117.869846883137
dipole: -25.26704 24.39523 -0.87181 -16.38523 16.47405 0.08883 10.92077 -10.87217 0.04859
magnitude: 0.87767 au
magnitude: 2.23087 debye
