program: Orca
programVersion: 5.0.2
elementType: O O O C C C C C C C C C C C C C C C C C C C C C C C H H H H H H H H H H H H H H H H H H H H H H H H H H
charge: 0
multiplicity: 1
keywords: wb97x-d3
keywords: def2-TZVPP
keywords: def2/J RIJCOSX
keywords: DEFGRID2
keywords: scfconv7
keywords: smallprint printgap noloewdin
keywords: NOSOSCF
formula: C23H26O3
InChI: InChI=1/C23H26O3/c1-16(2)13-20-21(23(20,3)4)22(24)25-15-17-9-8-12-19(14-17)26-18-10-6-5-7-11-18/h5-14,20-21H,15H2,1-4H3
52 atoms
O  -1.719728 1.986051 0.345748
O  -0.703664 0.056713 0.842993
O  3.535143 0.879705 -1.450702
C  -3.042658 -1.286005 -0.684592
C  -3.533155 -1.162506 0.717209
C  -2.953071 0.059336 0.010658
C  -4.076393 -1.372124 -1.783011
C  -1.799097 -2.087782 -0.983904
C  -2.851919 -1.835836 1.850615
C  -1.66962 0.649796 0.442739
C  -2.70151 -1.336244 3.076171
C  -2.007175 -2.113584 4.152099
C  -3.173417 0.026513 3.479767
C  -0.520084 2.703529 0.64221
C  0.454234 2.618017 -0.498063
C  1.567663 1.795826 -0.407776
C  0.215588 3.330071 -1.669358
C  2.422993 1.665578 -1.494427
C  1.086592 3.21366 -2.739373
C  2.187691 2.374447 -2.662524
C  3.486258 -0.358144 -0.877554
C  4.662215 -0.82366 -0.304414
C  2.349131 -1.157477 -0.894823
C  4.699907 -2.092914 0.249927
C  2.400455 -2.421071 -0.327525
C  3.569814 -2.897364 0.245442
H  -4.614504 -1.100191 0.819471
H  -3.680075 0.795411 -0.312977
H  -4.385278 -2.407609 -1.937703
H  -3.675994 -0.999669 -2.727503
H  -4.971051 -0.792999 -1.550395
H  -1.306002 -1.705472 -1.879872
H  -2.074557 -3.125912 -1.180912
H  -1.074445 -2.076198 -0.174834
H  -2.467377 -2.831811 1.653252
H  -1.111275 -1.588451 4.491606
H  -1.704155 -3.102405 3.810951
H  -2.648652 -2.240078 5.027596
H  -2.330025 0.644295 3.798844
H  -3.851925 -0.03565 4.33424
H  -3.692233 0.554816 2.682519
H  -0.073307 2.344523 1.571032
H  -0.846072 3.731951 0.796704
H  1.747418 1.234326 0.499748
H  -0.651995 3.973917 -1.74409
H  0.904411 3.77097 -3.648635
H  2.865812 2.266545 -3.498752
H  5.539106 -0.189593 -0.299783
H  1.425415 -0.802987 -1.332178
H  5.619321 -2.450014 0.695085
H  1.509729 -3.03536 -0.33691
H  3.59956 -3.884712 0.68561
totalener: -1117.84281269 hartree
nucrepener: 2324.67866118 hartree
electener: -3442.52147387 hartree
oneelecener: -6138.46684714 hartree
twoeener: 2695.94537327 hartree
kineticenergy: 1112.86909230 hartree
xcener: -110.235002488287 hartree
chargesum: -0.0000000
charge: -0.268530 -0.389067 -0.300934 0.146869 -0.047908 -0.106092 -0.243147 -0.310302 -0.199029 0.352164 0.012049 -0.210733 -0.258695 0.052542 0.000949 -0.151504 -0.198843 0.234248 -0.083285 -0.213932 0.268053 -0.226295 -0.158328 -0.085973 -0.097830 -0.156613 0.098404 0.086180 0.086993 0.091260 0.070843 0.091181 0.093532 0.098235 0.086586 0.089840 0.076004 0.082503 0.090841 0.097060 0.085863 0.102912 0.112355 0.130628 0.110628 0.124461 0.124833 0.121552 0.124840 0.121773 0.119538 0.121320
qa: -0.2685 -0.3891 -0.3009 0.1469 -0.0479 -0.1061 -0.2431 -0.3103 -0.1990 0.3522 0.0120 -0.2107 -0.2587 0.0525 0.0009 -0.1515 -0.1988 0.2342 -0.0833 -0.2139 0.2681 -0.2263 -0.1583 -0.0860 -0.0978 -0.1566 0.0984 0.0862 0.0870 0.0913 0.0708 0.0912 0.0935 0.0982 0.0866 0.0898 0.0760 0.0825 0.0908 0.0971 0.0859 0.1029 0.1124 0.1306 0.1106 0.1245 0.1248 0.1216 0.1248 0.1218 0.1195 0.1213
va: 2.1171 2.0812 2.1152 3.7030 3.8995 3.7982 3.9060 3.9250 3.9015 4.1344 3.7378 3.9420 3.9472 3.8723 3.6459 3.8996 4.0255 3.8466 3.9256 4.0556 3.8243 4.0359 3.9360 3.9352 3.9494 3.9869 1.0048 1.0313 1.0049 1.0042 1.0081 1.0016 1.0007 1.0083 1.0102 0.9988 1.0111 0.9987 1.0005 1.0010 1.0086 1.0101 0.9922 1.0214 1.0135 0.9991 1.0127 1.0155 1.0027 0.9989 1.0009 1.0017
dispcorr: -0.026978677 hartree
energy: -1117.869791361745
dipole: -20.92100 20.11398 -0.80702 -12.44464 12.61018 0.16554 9.56307 -9.50556 0.05751
magnitude: 0.82583 au
magnitude: 2.09908 debye
