program: Orca
programVersion: 5.0.2
elementType: O O O C C C C C C C C C C C C C C C C C C C C C C C H H H H H H H H H H H H H H H H H H H H H H H H H H
charge: 0
multiplicity: 1
keywords: wb97x-d3
keywords: def2-TZVPP
keywords: def2/J RIJCOSX
keywords: DEFGRID2
keywords: scfconv7
keywords: smallprint printgap noloewdin
keywords: NOSOSCF
formula: C23H26O3
InChI: InChI=1/C23H26O3/c1-16(2)13-20-21(23(20,3)4)22(24)25-15-17-9-8-12-19(14-17)26-18-10-6-5-7-11-18/h5-14,20-21H,15H2,1-4H3
52 atoms
O  -2.076856 1.155401 -1.692994
O  -1.447414 -0.911475 -1.116179
O  2.898368 0.527839 0.820243
C  -4.268936 -1.256757 0.098988
C  -3.492683 -0.52394 1.138706
C  -3.515111 -0.00922 -0.305986
C  -5.772412 -1.100182 0.13672
C  -3.839536 -2.626086 -0.367572
C  -2.255737 -1.069998 1.747687
C  -2.250625 -0.018693 -1.066807
C  -1.292455 -0.332877 2.300933
C  -0.079247 -0.966843 2.908765
C  -1.314807 1.16392 2.33474
C  -0.808766 1.382935 -2.306336
C  0.20126 1.837747 -1.28923
C  1.120241 0.942555 -0.755729
C  0.180163 3.154099 -0.83899
C  2.018186 1.373257 0.213258
C  1.074668 3.571587 0.132703
C  2.00089 2.68621 0.660636
C  3.506728 -0.463714 0.105813
C  3.601726 -1.713213 0.699735
C  4.070321 -0.230886 -1.142581
C  4.271292 -2.733859 0.042714
C  4.729207 -1.262958 -1.791953
C  4.834993 -2.515868 -1.205218
H  -4.087077 0.095818 1.805318
H  -4.12101 0.873351 -0.475628
H  -6.073446 -0.108188 0.476579
H  -6.215422 -1.829439 0.817509
H  -6.208357 -1.258793 -0.851176
H  -2.763294 -2.762094 -0.389687
H  -4.21492 -2.816626 -1.374379
H  -4.267715 -3.385353 0.290121
H  -2.140292 -2.148581 1.744479
H  0.015121 -0.70766 3.966438
H  0.829467 -0.610215 2.417849
H  -0.102621 -2.053027 2.828502
H  -1.198104 1.532776 3.356805
H  -2.229054 1.588788 1.92559
H  -0.478624 1.570284 1.760248
H  -0.989773 2.167943 -3.040626
H  -0.464383 0.493931 -2.836572
H  1.114592 -0.090535 -1.078547
H  -0.538943 3.852672 -1.248459
H  1.058039 4.595753 0.481088
H  2.705349 3.001524 1.418938
H  3.15398 -1.877355 1.671242
H  4.00038 0.746978 -1.601603
H  4.344626 -3.707283 0.509213
H  5.170659 -1.08079 -2.762889
H  5.353738 -3.315111 -1.716732
totalener: -1117.84423216 hartree
nucrepener: 2349.12142819 hartree
electener: -3466.96566035 hartree
oneelecener: -6187.38891962 hartree
twoeener: 2720.42325927 hartree
kineticenergy: 1112.86822745 hartree
xcener: -110.235958970000 hartree
chargesum: -0.0000000
charge: -0.266893 -0.390009 -0.307014 0.145107 -0.056842 -0.115390 -0.243444 -0.283672 -0.173022 0.361148 -0.008947 -0.198269 -0.211123 0.040722 -0.018826 -0.074296 -0.173101 0.170306 -0.084512 -0.211073 0.227376 -0.189941 -0.150303 -0.097176 -0.121380 -0.138849 0.089950 0.079705 0.069866 0.088082 0.089779 0.105755 0.084747 0.086997 0.081249 0.086906 0.066181 0.078197 0.094842 0.081384 0.052669 0.107363 0.108443 0.133765 0.108480 0.123266 0.124266 0.125051 0.129104 0.124088 0.125421 0.123868
qa: -0.2669 -0.3900 -0.3070 0.1451 -0.0568 -0.1154 -0.2434 -0.2837 -0.1730 0.3611 -0.0089 -0.1983 -0.2111 0.0407 -0.0188 -0.0743 -0.1731 0.1703 -0.0845 -0.2111 0.2274 -0.1899 -0.1503 -0.0972 -0.1214 -0.1388 0.0900 0.0797 0.0699 0.0881 0.0898 0.1058 0.0847 0.0870 0.0812 0.0869 0.0662 0.0782 0.0948 0.0814 0.0527 0.1074 0.1084 0.1338 0.1085 0.1233 0.1243 0.1251 0.1291 0.1241 0.1254 0.1239
va: 2.1208 2.0898 2.0613 3.7278 3.8912 3.8380 3.9022 3.9076 3.8772 4.1625 3.7656 3.9432 3.9481 3.8820 3.6925 3.7931 3.9917 3.7954 3.9239 4.0180 3.8529 4.0172 3.9516 3.9579 3.9572 3.9624 1.0057 1.0323 1.0072 1.0045 1.0050 1.0207 1.0048 0.9977 1.0126 1.0014 1.0076 1.0101 1.0060 1.0112 1.0155 0.9932 1.0119 1.0299 1.0123 1.0000 1.0146 1.0102 1.0055 1.0003 1.0002 1.0005
dispcorr: -0.028860490 hartree
energy: -1117.873092654720
dipole: -17.51175 17.31530 -0.19645 -6.52851 6.96135 0.43284 7.99856 -8.19398 -0.19542
magnitude: 0.51394 au
magnitude: 1.30632 debye
