program: Orca
programVersion: 5.0.2
elementType: O O O C C C C C C C C C C C C C C C C C C C C C C C H H H H H H H H H H H H H H H H H H H H H H H H H H
charge: 0
multiplicity: 1
keywords: wb97x-d3
keywords: def2-TZVPP
keywords: def2/J RIJCOSX
keywords: DEFGRID2
keywords: scfconv7
keywords: smallprint printgap noloewdin
keywords: NOSOSCF
formula: C23H26O3
InChI: InChI=1/C23H26O3/c1-16(2)13-20-21(23(20,3)4)22(24)25-15-17-9-8-12-19(14-17)26-18-10-6-5-7-11-18/h5-14,20-21H,15H2,1-4H3
52 atoms
O  -1.259856 1.253903 -1.179728
O  -1.51361 1.153368 1.040447
O  3.802175 0.737051 -1.228959
C  -1.663775 -1.918009 0.62397
C  -3.072945 -1.442394 0.499213
C  -1.966505 -0.770654 -0.318491
C  -1.315365 -3.220041 -0.06056
C  -0.87787 -1.703275 1.893138
C  -3.792713 -0.738073 1.581677
C  -1.566124 0.6196 -0.033943
C  -5.054152 -0.308356 1.512471
C  -5.710672 0.351917 2.687055
C  -5.919337 -0.420447 0.294028
C  -0.742704 2.570075 -1.061251
C  0.698705 2.578968 -0.63044
C  1.577745 1.619497 -1.115229
C  1.172616 3.574459 0.214699
C  2.913841 1.655343 -0.743939
C  2.514397 3.617153 0.558162
C  3.393519 2.653556 0.089126
C  3.547691 -0.5914 -1.066793
C  4.073217 -1.45112 -2.023016
C  2.841912 -1.098101 0.018552
C  3.894597 -2.818277 -1.890439
C  2.671432 -2.469534 0.13579
C  3.190192 -3.336768 -0.813498
H  -3.704587 -2.072721 -0.118743
H  -1.951815 -1.020631 -1.3729
H  -1.902995 -3.376714 -0.966143
H  -1.50344 -4.065341 0.604212
H  -0.260967 -3.24014 -0.342732
H  0.191262 -1.715837 1.675332
H  -1.082244 -2.517313 2.591187
H  -1.091522 -0.764682 2.394267
H  -3.256171 -0.576602 2.508634
H  -6.043432 1.361751 2.433968
H  -5.040381 0.425942 3.542222
H  -6.600439 -0.199131 3.00288
H  -6.809198 -1.020643 0.50044
H  -5.41067 -0.857919 -0.56214
H  -6.276481 0.566224 -0.010801
H  -1.347677 3.172148 -0.379878
H  -0.838607 2.998101 -2.060619
H  1.226979 0.837554 -1.777804
H  0.489586 4.31446 0.612426
H  2.877576 4.396089 1.215256
H  4.439795 2.668934 0.363739
H  4.621454 -1.041931 -2.861448
H  2.433534 -0.435772 0.771156
H  4.306521 -3.481619 -2.639509
H  2.13216 -2.862043 0.988429
H  3.05196 -4.404491 -0.711709
totalener: -1117.84416132 hartree
nucrepener: 2301.40398153 hartree
electener: -3419.24814286 hartree
oneelecener: -6091.59539707 hartree
twoeener: 2672.34725421 hartree
kineticenergy: 1112.86591349 hartree
xcener: -110.236210837535 hartree
chargesum: 0.0000000
charge: -0.282752 -0.380300 -0.301723 0.143427 -0.060176 -0.034243 -0.237448 -0.277717 -0.165147 0.318365 -0.029296 -0.213609 -0.249654 0.074040 0.061366 -0.209035 -0.168209 0.211629 -0.091429 -0.200544 0.235893 -0.209952 -0.127397 -0.089177 -0.173128 -0.145430 0.085675 0.079311 0.070896 0.088301 0.088520 0.054404 0.097459 0.107657 0.086941 0.082995 0.080162 0.082662 0.088105 0.078354 0.085710 0.100285 0.105165 0.128560 0.106104 0.124773 0.125658 0.124244 0.135579 0.124248 0.144515 0.125364
qa: -0.2828 -0.3803 -0.3017 0.1434 -0.0602 -0.0342 -0.2374 -0.2777 -0.1651 0.3184 -0.0293 -0.2136 -0.2497 0.0740 0.0614 -0.2090 -0.1682 0.2116 -0.0914 -0.2005 0.2359 -0.2100 -0.1274 -0.0892 -0.1731 -0.1454 0.0857 0.0793 0.0709 0.0883 0.0885 0.0544 0.0975 0.1077 0.0869 0.0830 0.0802 0.0827 0.0881 0.0784 0.0857 0.1003 0.1052 0.1286 0.1061 0.1248 0.1257 0.1242 0.1356 0.1242 0.1445 0.1254
va: 2.1138 2.1066 2.1030 3.7493 3.8755 3.8373 3.8952 3.9086 3.9131 4.1683 3.7798 3.9439 3.9512 3.8673 3.6632 3.9670 4.0237 3.8353 3.9383 4.0515 3.8493 4.0288 3.8710 3.9474 3.9302 3.9567 1.0058 1.0305 1.0099 1.0032 1.0103 1.0229 0.9992 1.0274 1.0193 0.9991 1.0120 0.9969 0.9986 1.0107 0.9998 1.0145 0.9874 1.0217 1.0122 0.9996 1.0112 1.0142 1.0052 0.9981 0.9865 1.0014
dispcorr: -0.026309368 hartree
energy: -1117.870470689463
dipole: -25.54548 25.11502 -0.43045 -12.11679 11.85366 -0.26313 9.37071 -9.68254 -0.31182
magnitude: 0.59309 au
magnitude: 1.50752 debye
