program: Orca
programVersion: 5.0.2
elementType: O O O C C C C C C C C C C C C C C C C C C C C C C C H H H H H H H H H H H H H H H H H H H H H H H H H H
charge: 0
multiplicity: 1
keywords: wb97x-d3
keywords: def2-TZVPP
keywords: def2/J RIJCOSX
keywords: DEFGRID2
keywords: scfconv7
keywords: smallprint printgap noloewdin
keywords: NOSOSCF
formula: C23H26O3
InChI: InChI=1/C23H26O3/c1-16(2)13-20-21(23(20,3)4)22(24)25-15-17-9-8-12-19(14-17)26-18-10-6-5-7-11-18/h5-14,20-21H,15H2,1-4H3
52 atoms
O  -0.935676 1.109137 -1.531454
O  -1.629767 1.445061 0.566122
O  4.111956 0.573992 -0.426329
C  -1.86318 -1.673366 0.604392
C  -3.224669 -1.1343 0.309627
C  -2.026287 -0.659041 -0.511997
C  -1.571411 -3.083187 0.146179
C  -1.144621 -1.316794 1.882401
C  -3.959979 -0.251063 1.238929
C  -1.53255 0.726204 -0.391961
C  -5.217124 0.168993 1.079997
C  -5.874155 1.028295 2.118632
C  -6.07242 -0.132855 -0.113849
C  -0.308879 2.387804 -1.515747
C  0.941223 2.390242 -0.679956
C  1.939616 1.460553 -0.943794
C  1.112412 3.308275 0.347345
C  3.095429 1.450862 -0.176594
C  2.282119 3.308216 1.091183
C  3.276174 2.376251 0.84089
C  3.83733 -0.749983 -0.597197
C  4.660217 -1.45634 -1.464622
C  2.820233 -1.401825 0.09135
C  4.465647 -2.816966 -1.640569
C  2.63464 -2.76231 -0.100102
C  3.449932 -3.477361 -0.964783
H  -3.857401 -1.811256 -0.255353
H  -1.954032 -1.0631 -1.515222
H  -0.506716 -3.215476 -0.054934
H  -2.111346 -3.338376 -0.766611
H  -1.861147 -3.804101 0.912898
H  -0.071294 -1.485363 1.768786
H  -1.4924 -1.960575 2.692595
H  -1.278203 -0.284117 2.190312
H  -3.43809 0.062444 2.134598
H  -6.799365 0.572967 2.481082
H  -6.147147 2.002655 1.705701
H  -5.225598 1.20026 2.976639
H  -6.40287 0.794684 -0.588423
H  -6.978854 -0.669147 0.179697
H  -5.566235 -0.721733 -0.875743
H  -1.002333 3.159161 -1.174144
H  -0.07085 2.58883 -2.560897
H  1.814904 0.738935 -1.742902
H  0.324191 4.013511 0.575498
H  2.413666 4.025186 1.890593
H  4.186693 2.359565 1.425075
H  5.448645 -0.935437 -1.991952
H  2.18027 -0.857677 0.774396
H  5.110291 -3.361589 -2.317954
H  1.846666 -3.268057 0.443285
H  3.297844 -4.538574 -1.107521
totalener: -1117.84380858 hartree
nucrepener: 2292.20150745 hartree
electener: -3410.04531603 hartree
oneelecener: -6073.19387030 hartree
twoeener: 2663.14855427 hartree
kineticenergy: 1112.85406644 hartree
xcener: -110.233021382217 hartree
chargesum: -0.0000000
charge: -0.275073 -0.384545 -0.301672 0.117537 -0.034302 -0.044834 -0.234360 -0.283499 -0.166606 0.329498 -0.032552 -0.211714 -0.250073 0.069913 0.021249 -0.216000 -0.131253 0.223115 -0.093929 -0.201761 0.243353 -0.215456 -0.152704 -0.083497 -0.111698 -0.165218 0.084095 0.080073 0.079926 0.072442 0.090594 0.066530 0.100707 0.108358 0.085236 0.080698 0.084027 0.079673 0.085803 0.087758 0.078024 0.098596 0.109735 0.124926 0.107010 0.123968 0.125659 0.124110 0.133253 0.123969 0.127626 0.123284
qa: -0.2751 -0.3845 -0.3017 0.1175 -0.0343 -0.0448 -0.2344 -0.2835 -0.1666 0.3295 -0.0326 -0.2117 -0.2501 0.0699 0.0212 -0.2160 -0.1313 0.2231 -0.0939 -0.2018 0.2434 -0.2155 -0.1527 -0.0835 -0.1117 -0.1652 0.0841 0.0801 0.0799 0.0724 0.0906 0.0665 0.1007 0.1084 0.0852 0.0807 0.0840 0.0797 0.0858 0.0878 0.0780 0.0986 0.1097 0.1249 0.1070 0.1240 0.1257 0.1241 0.1333 0.1240 0.1276 0.1233
va: 2.1185 2.1037 2.1062 3.7769 3.8450 3.8343 3.8902 3.9142 3.9147 4.1778 3.7857 3.9431 3.9500 3.8675 3.6876 3.9543 3.9878 3.8245 3.9415 4.0384 3.8606 4.0340 3.9173 3.9388 3.9351 4.0037 1.0071 1.0298 1.0167 1.0102 1.0033 1.0110 0.9998 1.0224 1.0206 0.9973 0.9988 1.0122 0.9993 0.9985 1.0113 1.0114 0.9902 1.0190 1.0160 0.9998 1.0116 1.0145 1.0000 0.9982 0.9978 1.0023
dispcorr: -0.025926364 hartree
energy: -1117.869734941896
dipole: -27.56571 27.19477 -0.37094 -10.01129 9.62276 -0.38854 7.23613 -7.59557 -0.35944
magnitude: 0.64634 au
magnitude: 1.64285 debye
