program: Orca
programVersion: 5.0.2
elementType: O O O C C C C C C C C C C C C C C C C C C C C C C C H H H H H H H H H H H H H H H H H H H H H H H H H H
charge: 0
multiplicity: 1
keywords: wb97x-d3
keywords: def2-TZVPP
keywords: def2/J RIJCOSX
keywords: DEFGRID2
keywords: scfconv7
keywords: smallprint printgap noloewdin
keywords: NOSOSCF
formula: C23H26O3
InChI: InChI=1/C23H26O3/c1-16(2)13-20-21(23(20,3)4)22(24)25-15-17-9-8-12-19(14-17)26-18-10-6-5-7-11-18/h5-14,20-21H,15H2,1-4H3
52 atoms
O  -1.812449 1.266355 0.04765
O  -3.246528 2.057576 1.559655
O  2.843314 -0.082039 -1.597196
C  -3.854304 -0.80924 -0.748793
C  -3.161503 -1.405999 0.430363
C  -3.753904 0.001352 0.526221
C  -5.246086 -1.319426 -1.051958
C  -3.09296 -0.450635 -2.002813
C  -1.702757 -1.673748 0.463343
C  -2.932915 1.206409 0.768558
C  -0.986247 -1.847693 1.575209
C  0.46517 -2.211605 1.519594
C  -1.555726 -1.701179 2.953295
C  -0.975115 2.397737 0.254705
C  0.205135 2.284193 -0.664253
C  0.97281 1.12385 -0.683774
C  0.556429 3.351998 -1.480046
C  2.087258 1.050801 -1.506869
C  1.669725 3.266965 -2.302893
C  2.444107 2.119957 -2.317061
C  3.290025 -0.705453 -0.471839
C  3.575425 -0.027406 0.707431
C  3.5030 -2.074946 -0.562246
C  4.06062 -0.735537 1.79687
C  3.99417 -2.766846 0.532599
C  4.268786 -2.104328 1.720141
H  -3.750276 -2.13232 0.985009
H  -4.672873 0.06643 1.097524
H  -5.830936 -0.566776 -1.583628
H  -5.792387 -1.582698 -0.14537
H  -5.20019 -2.211211 -1.679556
H  -2.061665 -0.159997 -1.832268
H  -3.5843 0.372998 -2.5236
H  -3.089992 -1.307865 -2.67888
H  -1.201393 -1.786541 -0.492771
H  0.824255 -2.324694 0.497969
H  0.653026 -3.154207 2.03993
H  1.089749 -1.461095 2.010836
H  -1.497191 -2.645942 3.500198
H  -2.592981 -1.372404 2.955726
H  -0.978941 -0.974761 3.531081
H  -0.649225 2.432349 1.298447
H  -1.524744 3.322237 0.061072
H  0.694702 0.278751 -0.064193
H  -0.044742 4.252506 -1.477984
H  1.937421 4.100918 -2.937751
H  3.315688 2.041184 -2.953133
H  3.426781 1.04198 0.780125
H  3.282454 -2.586961 -1.489871
H  4.282854 -0.204598 2.713302
H  4.155682 -3.834013 0.456048
H  4.64659 -2.648208 2.575116
totalener: -1117.84122327 hartree
nucrepener: 2343.21548142 hartree
electener: -3461.05670469 hartree
oneelecener: -6174.88800941 hartree
twoeener: 2713.83130472 hartree
kineticenergy: 1112.85995023 hartree
xcener: -110.235707596053 hartree
chargesum: -0.0000000
charge: -0.260728 -0.366952 -0.297949 0.151781 -0.051089 -0.130663 -0.246445 -0.268615 -0.201625 0.342421 -0.006507 -0.237109 -0.250926 0.042131 -0.004855 -0.147949 -0.138045 0.219124 -0.105391 -0.189732 0.275275 -0.169344 -0.254461 -0.123992 -0.066371 -0.152329 0.092713 0.088479 0.091648 0.072028 0.086353 0.085380 0.091081 0.088316 0.097245 0.087349 0.099893 0.088499 0.094702 0.087879 0.088932 0.107837 0.092628 0.106520 0.111177 0.125912 0.126638 0.127905 0.125923 0.126709 0.124252 0.124349
qa: -0.2607 -0.3670 -0.2979 0.1518 -0.0511 -0.1307 -0.2464 -0.2686 -0.2016 0.3424 -0.0065 -0.2371 -0.2509 0.0421 -0.0049 -0.1479 -0.1380 0.2191 -0.1054 -0.1897 0.2753 -0.1693 -0.2545 -0.1240 -0.0664 -0.1523 0.0927 0.0885 0.0916 0.0720 0.0864 0.0854 0.0911 0.0883 0.0972 0.0873 0.0999 0.0885 0.0947 0.0879 0.0889 0.1078 0.0926 0.1065 0.1112 0.1259 0.1266 0.1279 0.1259 0.1267 0.1243 0.1243
va: 2.1031 2.1437 2.1090 3.7162 3.8407 3.8610 3.9090 3.9253 3.8582 4.2107 3.7384 3.9421 3.9507 3.8405 3.7852 3.9182 3.9537 3.8078 3.9626 4.0200 3.7503 3.9135 3.9884 3.9223 3.8906 3.9469 1.0072 1.0286 1.0043 1.0082 1.0043 1.0099 1.0049 1.0001 1.0057 1.0013 1.0016 0.9933 0.9994 1.0093 1.0012 0.9965 1.0121 1.0011 1.0104 1.0002 1.0119 1.0079 1.0153 1.0004 0.9987 1.0011
dispcorr: -0.029197357 hartree
energy: -1117.870420631604
dipole: -13.06123 13.49262 0.43139 -12.35193 11.87161 -0.48032 4.47460 -4.69374 -0.21915
magnitude: 0.68179 au
magnitude: 1.73297 debye
