program: Orca
programVersion: 5.0.2
elementType: O O O C C C C C C C C C C C C C C C C C C C C C C C H H H H H H H H H H H H H H H H H H H H H H H H H H
charge: 0
multiplicity: 1
keywords: wb97x-d3
keywords: def2-TZVPP
keywords: def2/J RIJCOSX
keywords: DEFGRID2
keywords: scfconv7
keywords: smallprint printgap noloewdin
keywords: NOSOSCF
formula: C23H26O3
InChI: InChI=1/C23H26O3/c1-16(2)13-20-21(23(20,3)4)22(24)25-15-17-9-8-12-19(14-17)26-18-10-6-5-7-11-18/h5-14,20-21H,15H2,1-4H3
52 atoms
O  -2.230459 1.709074 -1.021672
O  -1.606495 -0.431098 -1.215105
O  3.43713 0.852741 -1.1326
C  -4.47743 -0.939951 -0.039142
C  -3.533104 -1.031043 1.109625
C  -3.466422 0.173774 0.180573
C  -5.913056 -0.573151 0.253341
C  -4.330444 -1.886162 -1.205133
C  -2.478105 -2.073122 1.174524
C  -2.334664 0.399825 -0.742568
C  -1.2526 -1.905017 1.667281
C  -0.260157 -3.025953 1.684628
C  -0.750525 -0.593419 2.185857
C  -1.224233 2.103076 -1.95068
C  0.105562 2.333722 -1.289949
C  1.148572 1.43115 -1.453951
C  0.310344 3.480533 -0.528419
C  2.389316 1.700506 -0.894419
C  1.546238 3.731807 0.043088
C  2.596627 2.844439 -0.141452
C  3.616231 -0.232399 -0.331106
C  4.545516 -1.170582 -0.767904
C  2.942673 -0.422254 0.867893
C  4.79478 -2.296172 -0.003335
C  3.203936 -1.558306 1.622303
C  4.124314 -2.500724 1.195521
H  -3.966335 -0.775637 2.074777
H  -3.882934 1.091746 0.579306
H  -6.500086 -1.466945 0.473086
H  -6.373198 -0.075658 -0.602232
H  -5.997849 0.094988 1.111273
H  -3.298684 -2.153102 -1.415457
H  -4.752734 -1.446155 -2.11035
H  -4.882284 -2.806336 -1.002134
H  -2.752184 -3.055205 0.801147
H  0.604372 -2.784893 1.06134
H  -0.690037 -3.956629 1.316161
H  0.119778 -3.205972 2.693818
H  -0.291182 -0.710734 3.170425
H  -1.530473 0.16056 2.270385
H  0.020851 -0.19825 1.520047
H  -1.592638 3.035685 -2.37939
H  -1.134454 1.373962 -2.757399
H  1.001919 0.525747 -2.029554
H  -0.49794 4.18944 -0.396964
H  1.700286 4.630236 0.625769
H  3.572825 3.039952 0.282671
H  5.063234 -1.009348 -1.704322
H  2.22194 0.303126 1.220372
H  5.517507 -3.022672 -0.350907
H  2.672906 -1.700555 2.554663
H  4.31941 -3.383374 1.789013
totalener: -1117.84211422 hartree
nucrepener: 2323.89590804 hartree
electener: -3441.73802226 hartree
oneelecener: -6136.78932812 hartree
twoeener: 2695.05130586 hartree
kineticenergy: 1112.86763295 hartree
xcener: -110.234347391988 hartree
chargesum: -0.0000000
charge: -0.265969 -0.385262 -0.301157 0.122123 -0.036505 -0.124030 -0.242263 -0.288269 -0.191539 0.355394 0.055034 -0.250517 -0.277802 0.048587 -0.031462 -0.099490 -0.151058 0.160118 -0.116943 -0.152595 0.269847 -0.204550 -0.143167 -0.092943 -0.193587 -0.130584 0.098290 0.083889 0.086954 0.089533 0.070840 0.113920 0.085458 0.087573 0.084651 0.102533 0.081419 0.080555 0.096280 0.094520 0.074330 0.110727 0.104095 0.122792 0.114582 0.126957 0.128326 0.121374 0.134804 0.121886 0.129767 0.122532
qa: -0.2660 -0.3853 -0.3012 0.1221 -0.0365 -0.1240 -0.2423 -0.2883 -0.1915 0.3554 0.0550 -0.2505 -0.2778 0.0486 -0.0315 -0.0995 -0.1511 0.1601 -0.1169 -0.1526 0.2698 -0.2046 -0.1432 -0.0929 -0.1936 -0.1306 0.0983 0.0839 0.0870 0.0895 0.0708 0.1139 0.0855 0.0876 0.0847 0.1025 0.0814 0.0806 0.0963 0.0945 0.0743 0.1107 0.1041 0.1228 0.1146 0.1270 0.1283 0.1214 0.1348 0.1219 0.1298 0.1225
va: 2.1198 2.0962 2.1073 3.7302 3.8851 3.8073 3.9039 3.9175 3.9060 4.1533 3.6664 3.9627 3.9568 3.8671 3.6758 3.9489 3.9884 3.9026 3.9382 3.9996 3.8283 4.0217 3.8589 3.9590 3.9662 3.9450 1.0041 1.0319 1.0046 1.0047 1.0082 1.0150 1.0043 0.9989 1.0099 0.9903 1.0162 0.9979 1.0025 1.0117 1.0031 0.9927 1.0148 1.0274 1.0110 0.9998 1.0075 1.0157 1.0019 0.9985 0.9968 1.0005
dispcorr: -0.028113995 hartree
energy: -1117.870228212211
dipole: -19.16180 18.59769 -0.56411 -12.21074 12.68229 0.47155 9.13441 -8.77714 0.35727
magnitude: 0.81745 au
magnitude: 2.07779 debye
