program: Orca
programVersion: 5.0.2
elementType: O O O C C C C C C C C C C C C C C C C C C C C C C C H H H H H H H H H H H H H H H H H H H H H H H H H H
charge: 0
multiplicity: 1
keywords: wb97x-d3
keywords: def2-TZVPP
keywords: def2/J RIJCOSX
keywords: DEFGRID2
keywords: scfconv7
keywords: smallprint printgap noloewdin
keywords: NOSOSCF
formula: C23H26O3
InChI: InChI=1/C23H26O3/c1-16(2)13-20-21(23(20,3)4)22(24)25-15-17-9-8-12-19(14-17)26-18-10-6-5-7-11-18/h5-14,20-21H,15H2,1-4H3
52 atoms
O  -1.481284 2.146754 0.91036
O  -2.238488 1.235597 -0.979942
O  3.370727 1.035074 -0.279494
C  -3.494802 -0.955883 0.832816
C  -2.08061 -1.426295 0.67354
C  -2.364774 0.015884 1.090045
C  -4.235296 -1.418389 2.066301
C  -4.386985 -0.834825 -0.377791
C  -1.49315 -1.772982 -0.637055
C  -2.046388 1.156109 0.204424
C  -1.019361 -2.974271 -0.980322
C  -0.416304 -3.199819 -2.334681
C  -1.041483 -4.187496 -0.099481
C  -0.985375 3.252082 0.16275
C  0.229581 2.885862 -0.644734
C  1.236666 2.12553 -0.063641
C  0.360125 3.311658 -1.95921
C  2.35303 1.772315 -0.808393
C  1.496487 2.985922 -2.683356
C  2.492513 2.205693 -2.119571
C  3.091895 -0.020378 0.540449
C  3.965212 -0.248726 1.595201
C  2.01459 -0.871626 0.32243
C  3.761332 -1.335698 2.431512
C  1.816507 -1.945612 1.175303
C  2.683781 -2.185826 2.230905
H  -1.706871 -2.016189 1.504496
H  -2.162695 0.22377 2.134332
H  -5.022798 -0.712612 2.336969
H  -3.573891 -1.522751 2.927804
H  -4.70423 -2.388174 1.890058
H  -5.177692 -0.103936 -0.199705
H  -4.863752 -1.798119 -0.567495
H  -3.862308 -0.540613 -1.280541
H  -1.45068 -0.987353 -1.381673
H  -0.459608 -2.30641 -2.955995
H  -0.928885 -4.00545 -2.866424
H  0.631805 -3.499343 -2.250652
H  -1.4255 -3.995893 0.900504
H  -0.042761 -4.621064 -0.001505
H  -1.669822 -4.964657 -0.542194
H  -0.73628 4.001345 0.91559
H  -1.762543 3.668618 -0.48204
H  1.144828 1.793906 0.963614
H  -0.433091 3.884222 -2.422625
H  1.596165 3.318493 -3.708172
H  3.370741 1.925491 -2.685842
H  4.798994 0.423341 1.75115
H  1.327382 -0.707427 -0.497955
H  4.446745 -1.51136 3.250429
H  0.970876 -2.596843 0.999794
H  2.521838 -3.028535 2.889469
totalener: -1117.84507498 hartree
nucrepener: 2361.32770228 hartree
electener: -3479.17277725 hartree
oneelecener: -6211.45210454 hartree
twoeener: 2732.27932729 hartree
kineticenergy: 1112.85089548 hartree
xcener: -110.235488334149 hartree
chargesum: -0.0000000
charge: -0.276674 -0.385704 -0.302821 0.137156 0.000690 -0.084704 -0.245103 -0.255163 -0.298891 0.325168 -0.012279 -0.220377 -0.259888 0.071959 0.056702 -0.238900 -0.164523 0.251927 -0.083303 -0.220204 0.276386 -0.233990 -0.213801 -0.059123 -0.024904 -0.220188 0.080520 0.084054 0.090459 0.072111 0.087842 0.087021 0.082097 0.106925 0.134925 0.085420 0.088521 0.086675 0.087269 0.086499 0.104841 0.107242 0.099421 0.127345 0.103514 0.123614 0.124358 0.123097 0.142107 0.123266 0.122192 0.119222
qa: -0.2767 -0.3857 -0.3028 0.1372 0.0007 -0.0847 -0.2451 -0.2552 -0.2989 0.3252 -0.0123 -0.2204 -0.2599 0.0720 0.0567 -0.2389 -0.1645 0.2519 -0.0833 -0.2202 0.2764 -0.2340 -0.2138 -0.0591 -0.0249 -0.2202 0.0805 0.0841 0.0905 0.0721 0.0878 0.0870 0.0821 0.1069 0.1349 0.0854 0.0885 0.0867 0.0873 0.0865 0.1048 0.1072 0.0994 0.1273 0.1035 0.1236 0.1244 0.1231 0.1421 0.1233 0.1222 0.1192
va: 2.1195 2.0964 2.1155 3.7835 3.7939 3.9348 3.9046 3.9187 3.8355 4.1674 3.7090 3.9337 3.9291 3.8653 3.6674 3.9425 4.0201 3.8109 3.9385 4.0513 3.8219 4.0549 3.9416 3.9061 3.8303 4.0512 1.0093 1.0295 1.0052 1.0077 1.0045 1.0034 1.0031 1.0193 1.0172 1.0111 0.9999 0.9979 1.0104 0.9972 1.0003 0.9889 1.0108 1.0207 1.0135 0.9993 1.0127 1.0146 1.0027 0.9982 0.9835 1.0053
dispcorr: -0.028326366 hartree
energy: -1117.873401342098
dipole: -17.87914 17.53348 -0.34566 -20.94394 20.61783 -0.32610 0.40645 0.10682 0.51327
magnitude: 0.69948 au
magnitude: 1.77792 debye
