program: Orca
programVersion: 5.0.2
elementType: O O O C C C C C C C C C C C C C C C C C C C C C C C H H H H H H H H H H H H H H H H H H H H H H H H H H
charge: 0
multiplicity: 1
keywords: wb97x-d3
keywords: def2-TZVPP
keywords: def2/J RIJCOSX
keywords: DEFGRID2
keywords: scfconv7
keywords: smallprint printgap noloewdin
keywords: NOSOSCF
formula: C23H26O3
InChI: InChI=1/C23H26O3/c1-16(2)13-20-21(23(20,3)4)22(24)25-15-17-9-8-12-19(14-17)26-18-10-6-5-7-11-18/h5-14,20-21H,15H2,1-4H3
52 atoms
O  -2.423139 1.73261 -1.304962
O  -2.289136 -0.488658 -1.528493
O  2.466903 -0.731488 -0.512821
C  -4.841275 -0.655593 0.207335
C  -3.73625 -0.476573 1.191002
C  -3.863508 0.47939 -0.001056
C  -6.22184 -0.22132 0.645059
C  -4.871128 -1.852047 -0.711787
C  -2.601403 -1.425268 1.305138
C  -2.796873 0.475103 -1.02101
C  -1.385262 -1.100502 1.74415
C  -0.293613 -2.121303 1.843544
C  -0.998051 0.288993 2.144703
C  -1.272536 1.896847 -2.133467
C  -0.012391 1.777327 -1.3220
C  0.711694 0.593518 -1.306784
C  0.413087 2.851672 -0.545796
C  1.848966 0.483004 -0.516729
C  1.547173 2.732853 0.238876
C  2.271522 1.549738 0.266081
C  3.794338 -0.821048 -0.203739
C  4.172216 -1.705748 0.794083
C  4.749453 -0.092068 -0.901422
C  5.51783 -1.865889 1.091361
C  6.089382 -0.253638 -0.588074
C  6.479914 -1.139331 0.406935
H  -4.02563 -0.006921 2.127941
H  -4.235011 1.469555 0.236816
H  -6.18707 0.63218 1.323494
H  -6.732519 -1.03385 1.164973
H  -6.834078 0.061728 -0.212825
H  -5.437313 -1.620917 -1.615539
H  -5.376746 -2.681005 -0.212153
H  -3.887091 -2.189514 -1.020323
H  -2.789619 -2.4544 1.017897
H  0.1005 -2.18042 2.86156
H  0.544076 -1.854385 1.195012
H  -0.635394 -3.114838 1.5562
H  -0.145066 0.635274 1.557403
H  -0.68604 0.31804 3.192031
H  -1.800448 1.011894 2.013377
H  -1.36559 2.900975 -2.54719
H  -1.281109 1.185956 -2.960865
H  0.383132 -0.257995 -1.888041
H  -0.145614 3.7792 -0.553547
H  1.874321 3.566056 0.84669
H  3.149078 1.465588 0.893355
H  3.414328 -2.266736 1.325441
H  4.447455 0.591647 -1.684535
H  5.812043 -2.559258 1.868038
H  6.833541 0.312716 -1.132338
H  7.527706 -1.263933 0.644158
totalener: -1117.84399805 hartree
nucrepener: 2315.39223907 hartree
electener: -3433.23623711 hartree
oneelecener: -6119.88403273 hartree
twoeener: 2686.64779562 hartree
kineticenergy: 1112.86814607 hartree
xcener: -110.236065567890 hartree
chargesum: -0.0000000
charge: -0.266502 -0.388139 -0.297711 0.142683 -0.056220 -0.117781 -0.244590 -0.280558 -0.180362 0.357916 -0.001740 -0.197844 -0.219453 0.040440 0.002486 -0.163006 -0.165798 0.188355 -0.112520 -0.148773 0.212784 -0.182417 -0.149223 -0.105816 -0.122699 -0.132290 0.093054 0.082002 0.070224 0.087300 0.089843 0.084615 0.085860 0.105675 0.080833 0.081480 0.075586 0.077998 0.052007 0.097551 0.084191 0.105849 0.108155 0.124197 0.108108 0.124993 0.130466 0.127923 0.132230 0.125796 0.126872 0.125968
qa: -0.2665 -0.3881 -0.2977 0.1427 -0.0562 -0.1178 -0.2446 -0.2806 -0.1804 0.3579 -0.0017 -0.1978 -0.2195 0.0404 0.0025 -0.1630 -0.1658 0.1884 -0.1125 -0.1488 0.2128 -0.1824 -0.1492 -0.1058 -0.1227 -0.1323 0.0931 0.0820 0.0702 0.0873 0.0898 0.0846 0.0859 0.1057 0.0808 0.0815 0.0756 0.0780 0.0520 0.0976 0.0842 0.1058 0.1082 0.1242 0.1081 0.1250 0.1305 0.1279 0.1322 0.1258 0.1269 0.1260
va: 2.1178 2.0933 2.0754 3.7295 3.8944 3.8261 3.9031 3.9066 3.8944 4.1689 3.7567 3.9382 3.9480 3.8780 3.6811 3.9462 3.9896 3.8003 3.9586 3.8965 3.8618 4.0057 3.9631 3.9515 3.9509 3.9510 1.0045 1.0315 1.0070 1.0049 1.0050 1.0048 0.9979 1.0203 1.0136 0.9985 1.0078 1.0139 1.0125 1.0048 1.0111 0.9935 1.0121 1.0367 1.0128 1.0015 1.0085 1.0076 1.0040 1.0004 1.0000 1.0000
dispcorr: -0.028619045 hartree
energy: -1117.872617090434
dipole: -16.63492 16.99162 0.35670 -4.87974 5.57733 0.69759 10.16026 -9.73831 0.42195
magnitude: 0.88989 au
magnitude: 2.26192 debye
