program: Orca
programVersion: 5.0.2
elementType: O O O C C C C C C C C C C C C C C C C C C C C C C C H H H H H H H H H H H H H H H H H H H H H H H H H H
charge: 0
multiplicity: 1
keywords: wb97x-d3
keywords: def2-TZVPP
keywords: def2/J RIJCOSX
keywords: DEFGRID2
keywords: scfconv7
keywords: smallprint printgap noloewdin
keywords: NOSOSCF
formula: C23H26O3
InChI: InChI=1/C23H26O3/c1-16(2)13-20-21(23(20,3)4)22(24)25-15-17-9-8-12-19(14-17)26-18-10-6-5-7-11-18/h5-14,20-21H,15H2,1-4H3
52 atoms
O  -1.854167 1.793507 -1.131195
O  -1.30345 -0.348645 -1.486726
O  3.544469 1.253121 -0.711351
C  -3.723663 -0.897923 0.431468
C  -2.496006 -0.91533 1.285613
C  -2.735218 0.251253 0.343306
C  -5.035366 -0.56831 1.103959
C  -3.861193 -1.88888 -0.69626
C  -1.396004 -1.897834 1.099103
C  -1.888976 0.485306 -0.845914
C  -1.441236 -3.151048 1.553326
C  -0.285523 -4.086602 1.366919
C  -2.622384 -3.731392 2.271004
C  -1.030484 2.232891 -2.213291
C  0.318325 2.668428 -1.71413
C  1.307744 1.727146 -1.450274
C  0.578613 4.016171 -1.492278
C  2.535236 2.139353 -0.950274
C  1.81481 4.420013 -1.013248
C  2.795777 3.483947 -0.729494
C  3.310104 0.131245 0.027266
C  4.120313 -0.965818 -0.234695
C  2.352326 0.071833 1.033032
C  3.973966 -2.121245 0.515001
C  2.211698 -1.095376 1.769059
C  3.018211 -2.195071 1.517851
H  -2.664667 -0.63652 2.323567
H  -3.059793 1.169584 0.81828
H  -5.488407 -1.469719 1.522142
H  -5.745467 -0.141024 0.393873
H  -4.910184 0.145986 1.918808
H  -4.508511 -1.491059 -1.480056
H  -4.324412 -2.803509 -0.320423
H  -2.911193 -2.160959 -1.145765
H  -0.499938 -1.569456 0.586279
H  0.102583 -4.430552 2.329807
H  0.532956 -3.619832 0.821153
H  -0.590488 -4.981536 0.818807
H  -3.450695 -3.031446 2.364485
H  -2.343931 -4.057558 3.276843
H  -2.992907 -4.618729 1.751386
H  -1.560211 3.077402 -2.65439
H  -0.940179 1.453711 -2.970827
H  1.119698 0.676626 -1.635322
H  -0.187392 4.753462 -1.69818
H  2.014514 5.470403 -0.848023
H  3.761454 3.785737 -0.345908
H  4.861677 -0.903771 -1.020408
H  1.72041 0.923621 1.247946
H  4.6098 -2.971717 0.30734
H  1.458645 -1.141786 2.544878
H  2.90234 -3.100031 2.09854
totalener: -1117.84403958 hartree
nucrepener: 2320.38759528 hartree
electener: -3438.23163486 hartree
oneelecener: -6129.69147519 hartree
twoeener: 2691.45984033 hartree
kineticenergy: 1112.85034364 hartree
xcener: -110.232667526315 hartree
chargesum: -0.0000000
charge: -0.265200 -0.401129 -0.301131 0.070802 -0.029511 -0.058191 -0.243492 -0.261068 -0.196320 0.336463 -0.017970 -0.238341 -0.257499 0.050076 0.001452 -0.164301 -0.182127 0.219890 -0.090134 -0.201882 0.265202 -0.216696 -0.150293 -0.075402 -0.147520 -0.178598 0.099279 0.084129 0.082742 0.093085 0.073956 0.091902 0.080417 0.115346 0.114897 0.083779 0.090702 0.091180 0.078256 0.095906 0.089934 0.095614 0.116184 0.152524 0.106942 0.124840 0.125409 0.122414 0.129081 0.123961 0.136901 0.133535
qa: -0.2652 -0.4011 -0.3011 0.0708 -0.0295 -0.0582 -0.2435 -0.2611 -0.1963 0.3365 -0.0180 -0.2383 -0.2575 0.0501 0.0015 -0.1643 -0.1821 0.2199 -0.0901 -0.2019 0.2652 -0.2167 -0.1503 -0.0754 -0.1475 -0.1786 0.0993 0.0841 0.0827 0.0931 0.0740 0.0919 0.0804 0.1153 0.1149 0.0838 0.0907 0.0912 0.0783 0.0959 0.0899 0.0956 0.1162 0.1525 0.1069 0.1248 0.1254 0.1224 0.1291 0.1240 0.1369 0.1335
va: 2.1327 2.0748 2.1108 3.7275 3.8378 3.8612 3.9034 3.9134 3.8706 4.1658 3.7152 3.9460 3.9425 3.8620 3.7227 3.9005 4.0281 3.8517 3.9405 4.0549 3.7962 4.0427 3.8873 3.9378 3.9046 3.9270 1.0026 1.0308 1.0057 1.0053 1.0078 1.0044 0.9999 1.0150 1.0036 0.9952 1.0075 1.0029 1.0094 1.0031 0.9988 0.9988 1.0150 1.0168 1.0121 0.9994 1.0119 1.0150 1.0065 0.9981 0.9961 0.9945
dispcorr: -0.027853016 hartree
energy: -1117.871892600170
dipole: -21.99432 21.34053 -0.65379 -20.19884 20.42016 0.22132 10.72253 -10.28054 0.44199
magnitude: 0.81962 au
magnitude: 2.08332 debye
