program: Orca
programVersion: 5.0.2
elementType: O O O C C C C C C C C C C C C C C C C C C C C C C C H H H H H H H H H H H H H H H H H H H H H H H H H H
charge: 0
multiplicity: 1
keywords: wb97x-d3
keywords: def2-TZVPP
keywords: def2/J RIJCOSX
keywords: DEFGRID2
keywords: scfconv7
keywords: smallprint printgap noloewdin
keywords: NOSOSCF
formula: C23H26O3
InChI: InChI=1/C23H26O3/c1-16(2)13-20-21(23(20,3)4)22(24)25-15-17-9-8-12-19(14-17)26-18-10-6-5-7-11-18/h5-14,20-21H,15H2,1-4H3
52 atoms
O  -1.857523 1.763149 -1.2551
O  -1.260425 -0.375492 -1.538382
O  3.549879 1.249387 -0.668831
C  -3.801632 -0.888154 0.24528
C  -2.63362 -0.913992 1.182282
C  -2.790906 0.242913 0.207594
C  -5.151744 -0.534126 0.821616
C  -3.87515 -1.899444 -0.870211
C  -1.558617 -1.930364 1.086774
C  -1.886227 0.462557 -0.941312
C  -1.463736 -2.995069 1.88657
C  -0.344381 -3.979418 1.728584
C  -2.436995 -3.319571 2.979384
C  -0.988371 2.191469 -2.306215
C  0.335911 2.635506 -1.75208
C  1.332964 1.704218 -1.483278
C  0.560564 3.979826 -1.476494
C  2.532259 2.120887 -0.921221
C  1.769633 4.389299 -0.937414
C  2.756788 3.462038 -0.646445
C  3.315906 0.087924 0.005903
C  4.208364 -0.951031 -0.225962
C  2.282072 -0.067092 0.921594
C  4.064799 -2.14476 0.46096
C  2.144877 -1.272514 1.593573
C  3.030582 -2.31547 1.369878
H  -2.869106 -0.612091 2.198832
H  -3.130965 1.169283 0.655437
H  -5.806037 -0.108926 0.058598
H  -5.073218 0.191318 1.632636
H  -5.64244 -1.424166 1.220556
H  -2.902465 -2.181978 -1.261563
H  -4.474575 -1.516124 -1.697986
H  -4.358915 -2.806511 -0.503214
H  -0.810759 -1.805867 0.314081
H  -0.7308 -4.98032 1.519321
H  0.242849 -4.06199 2.647948
H  0.332208 -3.703238 0.921398
H  -3.265176 -2.616906 3.045509
H  -1.938843 -3.346123 3.95197
H  -2.864665 -4.313499 2.826725
H  -1.501208 3.029681 -2.778094
H  -0.864467 1.404514 -3.050715
H  1.169949 0.657318 -1.707404
H  -0.211553 4.709639 -1.686007
H  1.942993 5.436762 -0.72954
H  3.700473 3.768317 -0.214666
H  5.010283 -0.813893 -0.939407
H  1.585946 0.737784 1.11675
H  4.764925 -2.949119 0.277329
H  1.328723 -1.392307 2.294065
H  2.916061 -3.251545 1.899267
totalener: -1117.84480675 hartree
nucrepener: 2313.23794556 hartree
electener: -3431.08275231 hartree
oneelecener: -6115.35044936 hartree
twoeener: 2684.26769705 hartree
kineticenergy: 1112.85375118 hartree
xcener: -110.233885248751 hartree
chargesum: 0.0000000
charge: -0.264006 -0.411147 -0.300512 0.141257 -0.035666 -0.104538 -0.250685 -0.256211 -0.231577 0.356727 -0.016758 -0.258484 -0.246092 0.047421 0.005750 -0.178296 -0.183831 0.234522 -0.088347 -0.206612 0.280127 -0.226528 -0.164920 -0.081953 -0.123212 -0.172642 0.091383 0.083976 0.091516 0.073226 0.086182 0.109366 0.088455 0.082389 0.140272 0.097530 0.085317 0.094406 0.075999 0.089919 0.086401 0.097244 0.115535 0.152358 0.106953 0.124781 0.125205 0.121766 0.126164 0.122847 0.138901 0.128123
qa: -0.2640 -0.4111 -0.3005 0.1413 -0.0357 -0.1045 -0.2507 -0.2562 -0.2316 0.3567 -0.0168 -0.2585 -0.2461 0.0474 0.0058 -0.1783 -0.1838 0.2345 -0.0883 -0.2066 0.2801 -0.2265 -0.1649 -0.0820 -0.1232 -0.1726 0.0914 0.0840 0.0915 0.0732 0.0862 0.1094 0.0885 0.0824 0.1403 0.0975 0.0853 0.0944 0.0760 0.0899 0.0864 0.0972 0.1155 0.1524 0.1070 0.1248 0.1252 0.1218 0.1262 0.1228 0.1389 0.1281
va: 2.1368 2.0612 2.1138 3.7036 3.8399 3.9493 3.9032 3.9174 3.8625 4.1449 3.6735 3.9556 3.9530 3.8633 3.7058 3.9052 4.0301 3.8432 3.9390 4.0596 3.7888 4.0439 3.9255 3.9524 3.9137 3.9452 1.0027 1.0301 1.0054 1.0076 1.0050 1.0162 1.0029 1.0033 1.0078 1.0044 0.9908 1.0046 1.0110 1.0000 0.9999 0.9981 1.0148 1.0158 1.0119 0.9994 1.0123 1.0153 1.0082 0.9986 0.9902 0.9975
dispcorr: -0.027253190 hartree
energy: -1117.872059936843
dipole: -22.00348 21.25879 -0.74469 -19.31755 19.55532 0.23778 11.78288 -11.36196 0.42092
magnitude: 0.88785 au
magnitude: 2.25673 debye
