program: Orca
programVersion: 5.0.2
elementType: O O O C C C C C C C C C C C C C C C C C C C C C C C H H H H H H H H H H H H H H H H H H H H H H H H H H
charge: 0
multiplicity: 1
keywords: wb97x-d3
keywords: def2-TZVPP
keywords: def2/J RIJCOSX
keywords: DEFGRID2
keywords: scfconv7
keywords: smallprint printgap noloewdin
keywords: NOSOSCF
formula: C23H26O3
InChI: InChI=1/C23H26O3/c1-16(2)13-20-21(23(20,3)4)22(24)25-15-17-9-8-12-19(14-17)26-18-10-6-5-7-11-18/h5-14,20-21H,15H2,1-4H3
52 atoms
O  -1.752497 1.138359 -0.48093
O  -3.767933 1.711016 0.278631
O  3.333611 0.884759 0.012363
C  -2.731272 -1.644221 -1.052706
C  -2.562673 -1.668993 0.430661
C  -3.382873 -0.557891 -0.227186
C  -3.707518 -2.635856 -1.646907
C  -1.552454 -1.387492 -1.960611
C  -1.26004 -1.414196 1.096411
C  -3.005099 0.868653 -0.11724
C  -1.116349 -0.906679 2.321943
C  0.238444 -0.755172 2.944685
C  -2.267103 -0.462229 3.172907
C  -1.300613 2.477734 -0.309621
C  0.141451 2.531856 -0.71861
C  1.055863 1.643594 -0.162145
C  0.57875 3.485551 -1.628016
C  2.390989 1.707406 -0.532081
C  1.920195 3.55498 -1.975005
C  2.83125 2.66181 -1.439173
C  3.089147 -0.447371 0.154127
C  2.309938 -1.17158 -0.740686
C  3.702427 -1.085989 1.224255
C  2.138911 -2.533816 -0.545567
C  3.529923 -2.449576 1.400299
C  2.741054 -3.180189 0.523558
H  -3.189448 -2.388799 0.951897
H  -4.454853 -0.660373 -0.102512
H  -4.106592 -2.270584 -2.594867
H  -4.55286 -2.824289 -0.983935
H  -3.218389 -3.592942 -1.837166
H  -0.775104 -0.775579 -1.514217
H  -1.873585 -0.89411 -2.879218
H  -1.104907 -2.343355 -2.242589
H  -0.364793 -1.713508 0.559787
H  0.298732 -1.302799 3.88875
H  0.448898 0.291214 3.182608
H  1.033659 -1.122641 2.296885
H  -2.119504 0.563138 3.520155
H  -2.344766 -1.082834 4.069616
H  -3.223545 -0.499937 2.655651
H  -1.419337 2.778101 0.735428
H  -1.899497 3.165652 -0.911466
H  0.721743 0.900801 0.553243
H  -0.129057 4.176251 -2.068857
H  2.256466 4.300805 -2.682775
H  3.877379 2.698156 -1.712539
H  1.84019 -0.683857 -1.584882
H  4.309701 -0.510158 1.910232
H  1.52878 -3.092167 -1.243752
H  4.008835 -2.940488 2.237145
H  2.600292 -4.242374 0.668912
totalener: -1117.84188240 hartree
nucrepener: 2395.60502849 hartree
electener: -3513.44691090 hartree
oneelecener: -6279.55762938 hartree
twoeener: 2766.11071848 hartree
kineticenergy: 1112.85699000 hartree
xcener: -110.236848342662 hartree
chargesum: 0.0000000
charge: -0.255111 -0.364087 -0.298377 0.164520 -0.057011 -0.131942 -0.251094 -0.251261 -0.139529 0.326396 -0.076001 -0.154628 -0.237533 0.037524 0.019221 -0.150557 -0.156759 0.244092 -0.094020 -0.201508 0.259786 -0.174041 -0.213105 -0.119168 -0.084233 -0.145069 0.094435 0.090746 0.092175 0.072855 0.085231 0.050779 0.097462 0.085543 0.076259 0.097046 0.087806 0.024558 0.087069 0.097763 0.090118 0.110096 0.094567 0.067346 0.111647 0.124928 0.125708 0.139501 0.121480 0.130039 0.123885 0.124456
qa: -0.2551 -0.3641 -0.2984 0.1645 -0.0570 -0.1319 -0.2511 -0.2513 -0.1395 0.3264 -0.0760 -0.1546 -0.2375 0.0375 0.0192 -0.1506 -0.1568 0.2441 -0.0940 -0.2015 0.2598 -0.1740 -0.2131 -0.1192 -0.0842 -0.1451 0.0944 0.0907 0.0922 0.0729 0.0852 0.0508 0.0975 0.0855 0.0763 0.0970 0.0878 0.0246 0.0871 0.0978 0.0901 0.1101 0.0946 0.0673 0.1116 0.1249 0.1257 0.1395 0.1215 0.1300 0.1239 0.1245
va: 2.1059 2.1411 2.1250 3.6931 3.8373 3.8444 3.9117 3.9289 3.7883 4.2312 3.7905 3.8956 3.9367 3.8347 3.7643 3.8865 3.9738 3.7929 3.9587 4.0297 3.7939 3.8668 3.9798 3.8930 3.9100 3.9554 1.0076 1.0288 1.0037 1.0082 1.0042 1.0098 1.0108 0.9983 1.0046 1.0042 1.0019 1.0385 1.0025 0.9985 1.0122 0.9963 1.0119 1.0447 1.0110 1.0001 1.0131 0.9976 1.0167 1.0022 0.9991 1.0014
dispcorr: -0.031622447 hartree
energy: -1117.873504850984
dipole: -11.04636 11.54373 0.49737 -13.49673 12.85673 -0.64000 4.25840 -4.45299 -0.19459
magnitude: 0.83357 au
magnitude: 2.11878 debye
